null
SMILES: CC(=O)N[C@H]1CSSC[C@H](NC(=O)[C@H](Cc2ccc(O)cc2)NC(=O)[C@H](CCCCN)NC(=O)[C@@H](Cc2c[nH]c3ccccc23)NC(=O)[C@H](Cc2ccccc2)NC1=O)C(N)=O
InChI Key: InChIKey=UHSPHALTSYXFRP-AWWLJPPNSA-N
Activity Spreadsheet -- Enzyme Inhibition Constant Data from BindingDB
Found 2 hits for monomerid = 50320467
Trg + Lig
Ki
nM
ΔG°
kcal/mole
IC50
nM
Kd
nM
EC50/IC50
nM
koff
s-1
kon
M-1s-1
pHTemp
°C
Urotensin-2 receptor
(RAT)
BDBM50320467
(Ac-[CFwKYC]-NH2 | CHEMBL1163477)
Show SMILES CC(=O)N[C@H]1CSSC[C@H](NC(=O)[C@H](Cc2ccc(O)cc2)NC(=O)[C@H](CCCCN)NC(=O)[C@@H](Cc2c[nH]c3ccccc23)NC(=O)[C@H](Cc2ccccc2)NC1=O)C(N)=O |r|
Show InChI InChI=1S/C43H53N9O8S2/c1-25(53)47-37-24-62-61-23-36(38(45)55)52-41(58)34(20-27-14-16-29(54)17-15-27)49-39(56)32(13-7-8-18-44)48-42(59)35(21-28-22-46-31-12-6-5-11-30(28)31)51-40(57)33(50-43(37)60)19-26-9-3-2-4-10-26/h2-6,9-12,14-17,22,32-37,46,54H,7-8,13,18-21,23-24,44H2,1H3,(H2,45,55)(H,47,53)(H,48,59)(H,49,56)(H,50,60)(H,51,57)(H,52,58)/t32-,33-,34-,35+,36-,37-/m0/s1
Reactome pathway
610n/an/an/an/an/an/an/an/a
Johnson& Johnson Pharmaceutical Research& Development
Curated by ChEMBL
Assay Description
Displacement of [125I]U2 from rat urotensin 2 receptor expressed in CHO cells
J Med Chem 53: 2695-708 (2010)
Article DOI: 10.1021/jm901294u
BindingDB Entry DOI: 10.7270/Q20G3K9N
Urotensin-2 receptor
(RAT)
BDBM50320467
(Ac-[CFwKYC]-NH2 | CHEMBL1163477)
Show SMILES CC(=O)N[C@H]1CSSC[C@H](NC(=O)[C@H](Cc2ccc(O)cc2)NC(=O)[C@H](CCCCN)NC(=O)[C@@H](Cc2c[nH]c3ccccc23)NC(=O)[C@H](Cc2ccccc2)NC1=O)C(N)=O |r|
Show InChI InChI=1S/C43H53N9O8S2/c1-25(53)47-37-24-62-61-23-36(38(45)55)52-41(58)34(20-27-14-16-29(54)17-15-27)49-39(56)32(13-7-8-18-44)48-42(59)35(21-28-22-46-31-12-6-5-11-30(28)31)51-40(57)33(50-43(37)60)19-26-9-3-2-4-10-26/h2-6,9-12,14-17,22,32-37,46,54H,7-8,13,18-21,23-24,44H2,1H3,(H2,45,55)(H,47,53)(H,48,59)(H,49,56)(H,50,60)(H,51,57)(H,52,58)/t32-,33-,34-,35+,36-,37-/m0/s1
Reactome pathway
n/an/an/an/a 26n/an/an/an/a
Johnson& Johnson Pharmaceutical Research& Development
Curated by ChEMBL
Assay Description
Agonist activity at rat urotensin 2 receptor expressed in CHO cells assessed as calcium mobilization by FLIPR
J Med Chem 53: 2695-708 (2010)
Article DOI: 10.1021/jm901294u
BindingDB Entry DOI: 10.7270/Q20G3K9N