BDBM50320792 CHEMBL1165388::Ethyl4-(5-[(2,4-diamino-6-quinazolinyl)methyl]amino-2-methoxyphenoxy)butanoate::ethyl 4-(5-{[(2,4-diaminoquinazolin-6-yl)methyl]amino}-2-methoxyphenoxy)butanoate
SMILES: CCOC(=O)CCCOc1cc(NCc2ccc3nc(N)nc(N)c3c2)ccc1OC
InChI Key: InChIKey=YUHXPHNBJFUHSN-UHFFFAOYSA-N
Data: 3 KI  2 IC50
PDB links: 1 PDB ID matches this monomer.
Activity Spreadsheet -- Enzyme Inhibition Constant Data from BindingDB
Found 5 hits for monomerid = 50320792
Trg + Lig
Ki
nM
ΔG°
kcal/mole
IC50
nM
Kd
nM
EC50/IC50
nM
koff
s-1
kon
M-1s-1
pHTemp
°C
Bifunctional dihydrofolate reductase-thymidylate synthase
(Trypanosoma cruzi)
BDBM50320792
(CHEMBL1165388 | Ethyl4-(5-[(2,4-diamino-6-quinazol...)
Show SMILES CCOC(=O)CCCOc1cc(NCc2ccc3nc(N)nc(N)c3c2)ccc1OC
Show InChI InChI=1S/C22H27N5O4/c1-3-30-20(28)5-4-10-31-19-12-15(7-9-18(19)29-2)25-13-14-6-8-17-16(11-14)21(23)27-22(24)26-17/h6-9,11-12,25H,3-5,10,13H2,1-2H3,(H4,23,24,26,27)
1.30n/an/an/an/an/an/an/an/a
University of Alabama
Curated by ChEMBL
Assay Description
Inhibition of Trypanosoma cruzi DHFR by spectrophotometric assay
Bioorg Med Chem 18: 4056-66 (2010)
Article DOI: 10.1016/j.bmc.2010.04.020
BindingDB Entry DOI: 10.7270/Q26110GG
3D
3D Structure (crystal)
Bifunctional dihydrofolate reductase-thymidylate synthase
(Trypanosoma cruzi)
BDBM50320792
(CHEMBL1165388 | Ethyl4-(5-[(2,4-diamino-6-quinazol...)
Show SMILES CCOC(=O)CCCOc1cc(NCc2ccc3nc(N)nc(N)c3c2)ccc1OC
Show InChI InChI=1S/C22H27N5O4/c1-3-30-20(28)5-4-10-31-19-12-15(7-9-18(19)29-2)25-13-14-6-8-17-16(11-14)21(23)27-22(24)26-17/h6-9,11-12,25H,3-5,10,13H2,1-2H3,(H4,23,24,26,27)
5.68n/an/an/an/an/an/an/an/a
University of Alabama
Curated by ChEMBL
Assay Description
Inhibition of Trypanosoma cruzi DHFR by Lineweaver-Burk plot
Bioorg Med Chem 18: 4056-66 (2010)
Article DOI: 10.1016/j.bmc.2010.04.020
BindingDB Entry DOI: 10.7270/Q26110GG
3D
3D Structure (crystal)
Dihydrofolate reductase
(Homo sapiens (Human))
BDBM50320792
(CHEMBL1165388 | Ethyl4-(5-[(2,4-diamino-6-quinazol...)
Show SMILES CCOC(=O)CCCOc1cc(NCc2ccc3nc(N)nc(N)c3c2)ccc1OC
Show InChI InChI=1S/C22H27N5O4/c1-3-30-20(28)5-4-10-31-19-12-15(7-9-18(19)29-2)25-13-14-6-8-17-16(11-14)21(23)27-22(24)26-17/h6-9,11-12,25H,3-5,10,13H2,1-2H3,(H4,23,24,26,27)
NCI pathway
Reactome pathway
9.60n/an/an/an/an/an/an/an/a
University of Alabama
Curated by ChEMBL
Assay Description
Inhibition of human DHFR by spectrophotometric assay
Bioorg Med Chem 18: 4056-66 (2010)
Article DOI: 10.1016/j.bmc.2010.04.020
BindingDB Entry DOI: 10.7270/Q26110GG
Dihydrofolate reductase
(Homo sapiens (Human))
BDBM50320792
(CHEMBL1165388 | Ethyl4-(5-[(2,4-diamino-6-quinazol...)
Show SMILES CCOC(=O)CCCOc1cc(NCc2ccc3nc(N)nc(N)c3c2)ccc1OC
Show InChI InChI=1S/C22H27N5O4/c1-3-30-20(28)5-4-10-31-19-12-15(7-9-18(19)29-2)25-13-14-6-8-17-16(11-14)21(23)27-22(24)26-17/h6-9,11-12,25H,3-5,10,13H2,1-2H3,(H4,23,24,26,27)
NCI pathway
Reactome pathway
n/an/a 68.3n/an/an/an/an/an/a
University of Alabama
Curated by ChEMBL
Assay Description
Inhibition of human DHFR by spectrophotometric assay
Bioorg Med Chem 18: 4056-66 (2010)
Article DOI: 10.1016/j.bmc.2010.04.020
BindingDB Entry DOI: 10.7270/Q26110GG
Bifunctional dihydrofolate reductase-thymidylate synthase
(Trypanosoma cruzi)
BDBM50320792
(CHEMBL1165388 | Ethyl4-(5-[(2,4-diamino-6-quinazol...)
Show SMILES CCOC(=O)CCCOc1cc(NCc2ccc3nc(N)nc(N)c3c2)ccc1OC
Show InChI InChI=1S/C22H27N5O4/c1-3-30-20(28)5-4-10-31-19-12-15(7-9-18(19)29-2)25-13-14-6-8-17-16(11-14)21(23)27-22(24)26-17/h6-9,11-12,25H,3-5,10,13H2,1-2H3,(H4,23,24,26,27)
n/an/a 23.8n/an/an/an/an/an/a
University of Alabama
Curated by ChEMBL
Assay Description
Inhibition of Trypanosoma cruzi DHFR by spectrophotometric assay
Bioorg Med Chem 18: 4056-66 (2010)
Article DOI: 10.1016/j.bmc.2010.04.020
BindingDB Entry DOI: 10.7270/Q26110GG
3D
3D Structure (crystal)