BDBM50320945 (3S,20S,23S)-3-(3'-Carboxybenzoyloxy)-20,23-dihydroxydammar-24-en-21-oic acid-21,23-lactone::CHEMBL1163236
SMILES: [#6]\[#6](-[#6])=[#6]\[#6@@H]-1-[#6][C@]([#8])([#6@H]-2-[#6]-[#6]-[#6@@H]3-[#6@@H]-2-[#6]-[#6]-[#6@H]2[C@@]3([#6])[#6]-[#6]-[#6@H]3C([#6])([#6])[#6@H](-[#6]-[#6][C@]23[#6])-[#8]-[#6](=O)-c2cccc(c2)-[#6](-[#8])=O)[#6](=O)-[#8]1
InChI Key: InChIKey=TWGJHKORPWJXCY-OQHOXCJBSA-N
Data: 2 IC50
Activity Spreadsheet -- Enzyme Inhibition Constant Data from BindingDB
Found 2 hits for monomerid = 50320945
Trg + Lig
Ki
nM
ΔG°
kcal/mole
IC50
nM
Kd
nM
EC50/IC50
nM
koff
s-1
kon
M-1s-1
pHTemp
°C
Tyrosine-protein phosphatase non-receptor type 2
(Homo sapiens (Human))
BDBM50320945
((3S,20S,23S)-3-(3'-Carboxybenzoyloxy)-20,23-dihydr...)
Show SMILES [#6]\[#6](-[#6])=[#6]\[#6@@H]-1-[#6][C@]([#8])([#6@H]-2-[#6]-[#6]-[#6@@H]3-[#6@@H]-2-[#6]-[#6]-[#6@H]2[C@@]3([#6])[#6]-[#6]-[#6@H]3C([#6])([#6])[#6@H](-[#6]-[#6][C@]23[#6])-[#8]-[#6](=O)-c2cccc(c2)-[#6](-[#8])=O)[#6](=O)-[#8]1 |r|
Show InChI InChI=1S/C37H50O7/c1-21(2)18-24-20-37(42,33(41)43-24)27-12-11-26-25(27)10-13-29-35(26,5)16-14-28-34(3,4)30(15-17-36(28,29)6)44-32(40)23-9-7-8-22(19-23)31(38)39/h7-9,18-19,24-30,42H,10-17,20H2,1-6H3,(H,38,39)/t24-,25+,26-,27+,28+,29+,30+,35+,36+,37+/m1/s1
n/an/a 1.62E+3n/an/an/an/an/an/a
Chinese Academy of Sciences
Curated by ChEMBL
Assay Description
Inhibition of TCPTP by pNPP hydrolase assay
Bioorg Med Chem 18: 3934-9 (2010)
Article DOI: 10.1016/j.bmc.2010.04.073
BindingDB Entry DOI: 10.7270/Q21C1X25
Protein-tyrosine phosphatase 1B
(Homo sapiens (Human))
BDBM50320945
((3S,20S,23S)-3-(3'-Carboxybenzoyloxy)-20,23-dihydr...)
Show SMILES [#6]\[#6](-[#6])=[#6]\[#6@@H]-1-[#6][C@]([#8])([#6@H]-2-[#6]-[#6]-[#6@@H]3-[#6@@H]-2-[#6]-[#6]-[#6@H]2[C@@]3([#6])[#6]-[#6]-[#6@H]3C([#6])([#6])[#6@H](-[#6]-[#6][C@]23[#6])-[#8]-[#6](=O)-c2cccc(c2)-[#6](-[#8])=O)[#6](=O)-[#8]1 |r|
Show InChI InChI=1S/C37H50O7/c1-21(2)18-24-20-37(42,33(41)43-24)27-12-11-26-25(27)10-13-29-35(26,5)16-14-28-34(3,4)30(15-17-36(28,29)6)44-32(40)23-9-7-8-22(19-23)31(38)39/h7-9,18-19,24-30,42H,10-17,20H2,1-6H3,(H,38,39)/t24-,25+,26-,27+,28+,29+,30+,35+,36+,37+/m1/s1
NCI pathway
Reactome pathway
n/an/a 330n/an/an/an/an/an/a
Chinese Academy of Sciences
Curated by ChEMBL
Assay Description
Inhibition of PTP1B by pNPP hydrolase assay
Bioorg Med Chem 18: 3934-9 (2010)
Article DOI: 10.1016/j.bmc.2010.04.073
BindingDB Entry DOI: 10.7270/Q21C1X25