BDBM50321270 CHEMBL1163910::ethyl 2-(m-tolyloxy)acetate
SMILES: CCOC(=O)COc1cccc(C)c1
InChI Key: InChIKey=YITOTGGGSHWZDB-UHFFFAOYSA-N
Data: 1 IC50
Activity Spreadsheet -- Enzyme Inhibition Constant Data from BindingDB
Found 1 hit for monomerid = 50321270
Trg + Lig
Ki
nM
ΔG°
kcal/mole
IC50
nM
Kd
nM
EC50/IC50
nM
koff
s-1
kon
M-1s-1
pHTemp
°C
3-hydroxy-3-methylglutaryl-coenzyme A reductase
(Schizosaccharomyces pombe)
BDBM50321270
(CHEMBL1163910 | ethyl 2-(m-tolyloxy)acetate)
Show SMILES CCOC(=O)COc1cccc(C)c1
Show InChI InChI=1S/C11H14O3/c1-3-13-11(12)8-14-10-6-4-5-9(2)7-10/h4-7H,3,8H2,1-2H3
Reactome pathway
n/an/a 1.82E+5n/an/an/an/an/an/a
Instituto Polit£cnico Nacional (IPN)
Curated by ChEMBL
Assay Description
Inhibition of Schizosaccharomyces pombe HMG-CoA reductase by spectrophotometry
Bioorg Med Chem 18: 4238-48 (2010)
Article DOI: 10.1016/j.bmc.2010.04.096
BindingDB Entry DOI: 10.7270/Q2KW5H0Z