BDBM50321271 CHEMBL1163911::ethyl 2-(3-ethylphenoxy)acetate
SMILES: CCOC(=O)COc1cccc(CC)c1
InChI Key: InChIKey=ZBUKWBHGABRARI-UHFFFAOYSA-N
Data: 1 IC50
Activity Spreadsheet -- Enzyme Inhibition Constant Data from BindingDB
Found 1 hit for monomerid = 50321271
Trg + Lig
Ki
nM
ΔG°
kcal/mole
IC50
nM
Kd
nM
EC50/IC50
nM
koff
s-1
kon
M-1s-1
pHTemp
°C
3-hydroxy-3-methylglutaryl-coenzyme A reductase
(Schizosaccharomyces pombe)
BDBM50321271
(CHEMBL1163911 | ethyl 2-(3-ethylphenoxy)acetate)
Show SMILES CCOC(=O)COc1cccc(CC)c1
Show InChI InChI=1S/C12H16O3/c1-3-10-6-5-7-11(8-10)15-9-12(13)14-4-2/h5-8H,3-4,9H2,1-2H3
Reactome pathway
n/an/a 1.62E+6n/an/an/an/an/an/a
Instituto Polit£cnico Nacional (IPN)
Curated by ChEMBL
Assay Description
Inhibition of Schizosaccharomyces pombe HMG-CoA reductase by spectrophotometry
Bioorg Med Chem 18: 4238-48 (2010)
Article DOI: 10.1016/j.bmc.2010.04.096
BindingDB Entry DOI: 10.7270/Q2KW5H0Z