BDBM50321277 2-Allyl-4,5-dimethoxyphenol::CHEMBL1163202
SMILES: COc1cc(O)c(CC=C)cc1OC
InChI Key: InChIKey=IHAVVJBEVFMSES-UHFFFAOYSA-N
Data: 1 IC50
Activity Spreadsheet -- Enzyme Inhibition Constant Data from BindingDB
Found 1 hit for monomerid = 50321277
Trg + Lig
Ki
nM
ΔG°
kcal/mole
IC50
nM
Kd
nM
EC50/IC50
nM
koff
s-1
kon
M-1s-1
pHTemp
°C
3-hydroxy-3-methylglutaryl-coenzyme A reductase
(Schizosaccharomyces pombe)
BDBM50321277
(2-Allyl-4,5-dimethoxyphenol | CHEMBL1163202)
Show SMILES COc1cc(O)c(CC=C)cc1OC
Show InChI InChI=1S/C11H14O3/c1-4-5-8-6-10(13-2)11(14-3)7-9(8)12/h4,6-7,12H,1,5H2,2-3H3
Reactome pathway
n/an/a 7.88E+4n/an/an/an/an/an/a
Instituto Polit£cnico Nacional (IPN)
Curated by ChEMBL
Assay Description
Inhibition of Schizosaccharomyces pombe HMG-CoA reductase by spectrophotometry
Bioorg Med Chem 18: 4238-48 (2010)
Article DOI: 10.1016/j.bmc.2010.04.096
BindingDB Entry DOI: 10.7270/Q2KW5H0Z