BDBM50321288 (2S,3R,4R,5S,6R)-2-(4-chloro-5-(4-ethylbenzyl)-2-(methoxymethyl)phenyl)-6-(hydroxymethyl)tetrahydro-2H-pyran-3,4,5-triol::CHEMBL1165446
SMILES: CCc1ccc(Cc2cc([C@@H]3O[C@H](CO)[C@@H](O)[C@H](O)[C@H]3O)c(COC)cc2Cl)cc1
InChI Key: InChIKey=JWQGYZZEOABZKH-ZQGJOIPISA-N
Data: 2 IC50
Activity Spreadsheet -- Enzyme Inhibition Constant Data from BindingDB
Found 2 hits for monomerid = 50321288
Trg + Lig
Ki
nM
ΔG°
kcal/mole
IC50
nM
Kd
nM
EC50/IC50
nM
koff
s-1
kon
M-1s-1
pHTemp
°C
Sodium/glucose cotransporter 1 (SGLT1)
(Homo sapiens (Human))
BDBM50321288
((2S,3R,4R,5S,6R)-2-(4-chloro-5-(4-ethylbenzyl)-2-(...)
Show SMILES CCc1ccc(Cc2cc([C@@H]3O[C@H](CO)[C@@H](O)[C@H](O)[C@H]3O)c(COC)cc2Cl)cc1 |r|
Show InChI InChI=1S/C23H29ClO6/c1-3-13-4-6-14(7-5-13)8-15-9-17(16(12-29-2)10-18(15)24)23-22(28)21(27)20(26)19(11-25)30-23/h4-7,9-10,19-23,25-28H,3,8,11-12H2,1-2H3/t19-,20-,21+,22-,23+/m1/s1
n/an/a>2.00E+3n/an/an/an/an/an/a
Chinese Academy of Sciences
Curated by ChEMBL
Assay Description
Inhibition of human SGLT1 expressed in african green monkey COS7 cells assessed as inhibition of [14C]-alpha-methyl-D-glucopyranoside uptake after 2 ...
Bioorg Med Chem 18: 4422-32 (2010)
Article DOI: 10.1016/j.bmc.2010.04.088
BindingDB Entry DOI: 10.7270/Q2TM7B8N
Sodium/glucose cotransporter 2
(Homo sapiens (Human))
BDBM50321288
((2S,3R,4R,5S,6R)-2-(4-chloro-5-(4-ethylbenzyl)-2-(...)
Show SMILES CCc1ccc(Cc2cc([C@@H]3O[C@H](CO)[C@@H](O)[C@H](O)[C@H]3O)c(COC)cc2Cl)cc1 |r|
Show InChI InChI=1S/C23H29ClO6/c1-3-13-4-6-14(7-5-13)8-15-9-17(16(12-29-2)10-18(15)24)23-22(28)21(27)20(26)19(11-25)30-23/h4-7,9-10,19-23,25-28H,3,8,11-12H2,1-2H3/t19-,20-,21+,22-,23+/m1/s1
n/an/a 0.900n/an/an/an/an/an/a
Chinese Academy of Sciences
Curated by ChEMBL
Assay Description
Inhibition of human SGLT2 expressed in HEK293 cells assessed as inhibition of [14C]-alpha-methyl-D-glucopyranoside uptake after 1.5 hrs by liquid sci...
Bioorg Med Chem 18: 4422-32 (2010)
Article DOI: 10.1016/j.bmc.2010.04.088
BindingDB Entry DOI: 10.7270/Q2TM7B8N