BDBM50321380 4-(1-(carboxymethyl)-2-oxo-2,3,4,5-tetrahydro-1H-benzo[b]azepin-3-ylthio)benzoicacid::CHEMBL1171416
SMILES: OC(=O)CN1c2ccccc2CCC(Sc2ccc(Cl)cc2Cl)C1=O
InChI Key: InChIKey=VARSFQQFESBNFC-UHFFFAOYSA-N
Data: 1 EC50
Activity Spreadsheet -- Enzyme Inhibition Constant Data from BindingDB
Found 1 hit for monomerid = 50321380
Trg + Lig
Ki
nM
ΔG°
kcal/mole
IC50
nM
Kd
nM
EC50/IC50
nM
koff
s-1
kon
M-1s-1
pHTemp
°C
3-phosphoinositide dependent protein kinase-1
(Homo sapiens (Human))
BDBM50321380
(4-(1-(carboxymethyl)-2-oxo-2,3,4,5-tetrahydro-1H-b...)
Show SMILES OC(=O)CN1c2ccccc2CCC(Sc2ccc(Cl)cc2Cl)C1=O
Show InChI InChI=1S/C18H15Cl2NO3S/c19-12-6-8-15(13(20)9-12)25-16-7-5-11-3-1-2-4-14(11)21(18(16)24)10-17(22)23/h1-4,6,8-9,16H,5,7,10H2,(H,22,23)
NCI pathway
Reactome pathway
n/an/an/an/a 7.50E+4n/an/an/an/a
Genomics Institute of the Novartis Research Foundation
Curated by ChEMBL
Assay Description
Displacement of PIFtide from His-tagged PDK1 by HTRF assay
Bioorg Med Chem Lett 20: 3897-902 (2010)
Article DOI: 10.1016/j.bmcl.2010.05.019
BindingDB Entry DOI: 10.7270/Q2Z60Q1H