BDBM50321455 2,5-dichloro-N-p-tolyl-N-(trichloromethylthio)thiophene-3-sulfonamide::CHEMBL1172329
SMILES: Cc1ccc(cc1)N(SC(Cl)(Cl)Cl)S(=O)(=O)c1cc(Cl)sc1Cl
InChI Key: InChIKey=PKAHLRVRIDTYNC-UHFFFAOYSA-N
Data: 5 IC50
Activity Spreadsheet -- Enzyme Inhibition Constant Data from BindingDB
Found 5 hits for monomerid = 50321455
Trg + Lig
Ki
nM
ΔG°
kcal/mole
IC50
nM
Kd
nM
EC50/IC50
nM
koff
s-1
kon
M-1s-1
pHTemp
°C
Cyclin-Dependent Kinase 1 (CDK1)
(Homo sapiens (Human))
BDBM50321455
(2,5-dichloro-N-p-tolyl-N-(trichloromethylthio)thio...)
Show SMILES Cc1ccc(cc1)N(SC(Cl)(Cl)Cl)S(=O)(=O)c1cc(Cl)sc1Cl
Show InChI InChI=1S/C12H8Cl5NO2S3/c1-7-2-4-8(5-3-7)18(22-12(15,16)17)23(19,20)9-6-10(13)21-11(9)14/h2-6H,1H3
Reactome pathway
n/an/a 1.05E+4n/an/an/an/an/an/a
Walter Reed Army Institute of Research
Curated by ChEMBL
Assay Description
Inhibition of human CDK1/cyclin B
Bioorg Med Chem Lett 20: 3863-7 (2010)
Article DOI: 10.1016/j.bmcl.2010.05.039
BindingDB Entry DOI: 10.7270/Q2F47Q3Q
CDK2/Cyclin A/Cyclin A1
(Homo sapiens (Human))
BDBM50321455
(2,5-dichloro-N-p-tolyl-N-(trichloromethylthio)thio...)
Show SMILES Cc1ccc(cc1)N(SC(Cl)(Cl)Cl)S(=O)(=O)c1cc(Cl)sc1Cl
Show InChI InChI=1S/C12H8Cl5NO2S3/c1-7-2-4-8(5-3-7)18(22-12(15,16)17)23(19,20)9-6-10(13)21-11(9)14/h2-6H,1H3
Reactome pathway
n/an/a 1.15E+4n/an/an/an/an/an/a
Walter Reed Army Institute of Research
Curated by ChEMBL
Assay Description
Inhibition of human CDK2/Cyclin A
Bioorg Med Chem Lett 20: 3863-7 (2010)
Article DOI: 10.1016/j.bmcl.2010.05.039
BindingDB Entry DOI: 10.7270/Q2F47Q3Q
Protein kinase Pfmrk
(Plasmodium falciparum)
BDBM50321455
(2,5-dichloro-N-p-tolyl-N-(trichloromethylthio)thio...)
Show SMILES Cc1ccc(cc1)N(SC(Cl)(Cl)Cl)S(=O)(=O)c1cc(Cl)sc1Cl
Show InChI InChI=1S/C12H8Cl5NO2S3/c1-7-2-4-8(5-3-7)18(22-12(15,16)17)23(19,20)9-6-10(13)21-11(9)14/h2-6H,1H3
n/an/a 300n/an/an/an/an/an/a
Walter Reed Army Institute of Research
Curated by ChEMBL
Assay Description
Inhibition of His6x-tagged Plasmodium falciparum Pfmrk expressed in Escherichia coli by microtiter plate scintillation counting
Bioorg Med Chem Lett 20: 3863-7 (2010)
Article DOI: 10.1016/j.bmcl.2010.05.039
BindingDB Entry DOI: 10.7270/Q2F47Q3Q
CDK6/cyclin D1
(Homo sapiens (Human))
BDBM50321455
(2,5-dichloro-N-p-tolyl-N-(trichloromethylthio)thio...)
Show SMILES Cc1ccc(cc1)N(SC(Cl)(Cl)Cl)S(=O)(=O)c1cc(Cl)sc1Cl
Show InChI InChI=1S/C12H8Cl5NO2S3/c1-7-2-4-8(5-3-7)18(22-12(15,16)17)23(19,20)9-6-10(13)21-11(9)14/h2-6H,1H3
n/an/a 1.80E+4n/an/an/an/an/an/a
Walter Reed Army Institute of Research
Curated by ChEMBL
Assay Description
Inhibition of human CDK6/Cyclin D1
Bioorg Med Chem Lett 20: 3863-7 (2010)
Article DOI: 10.1016/j.bmcl.2010.05.039
BindingDB Entry DOI: 10.7270/Q2F47Q3Q
Cyclin-Dependent Kinase 7 (CDK7)
(Homo sapiens (Human))
BDBM50321455
(2,5-dichloro-N-p-tolyl-N-(trichloromethylthio)thio...)
Show SMILES Cc1ccc(cc1)N(SC(Cl)(Cl)Cl)S(=O)(=O)c1cc(Cl)sc1Cl
Show InChI InChI=1S/C12H8Cl5NO2S3/c1-7-2-4-8(5-3-7)18(22-12(15,16)17)23(19,20)9-6-10(13)21-11(9)14/h2-6H,1H3
NCI pathway
Reactome pathway
n/an/a 700n/an/an/an/an/an/a
Walter Reed Army Institute of Research
Curated by ChEMBL
Assay Description
Inhibition of human CDK7/Cyclin H/MAT1
Bioorg Med Chem Lett 20: 3863-7 (2010)
Article DOI: 10.1016/j.bmcl.2010.05.039
BindingDB Entry DOI: 10.7270/Q2F47Q3Q