BDBM50321852 (S)-8-{5-[3-Methyl-4-(trifluoromethyl)phenyl]oxazol-2-ylamino}-1,2,3,4-tetrahydronaphthalen-2-ol::CHEMBL1173241
SMILES: Cc1nc(Nc2cccc3CC[C@H](O)Cc23)oc1-c1ccc(cc1)C(F)(F)F
InChI Key: InChIKey=CHLCWXNTFXVPAL-INIZCTEOSA-N
Data: 1 IC50
Activity Spreadsheet -- Enzyme Inhibition Constant Data from BindingDB
Found 1 hit for monomerid = 50321852
Trg + Lig
Ki
nM
ΔG°
kcal/mole
IC50
nM
Kd
nM
EC50/IC50
nM
koff
s-1
kon
M-1s-1
pHTemp
°C
Transient receptor potential cation channel subfamily V member 1
(Homo sapiens (Human))
BDBM50321852
((S)-8-{5-[3-Methyl-4-(trifluoromethyl)phenyl]oxazo...)
Show SMILES Cc1nc(Nc2cccc3CC[C@H](O)Cc23)oc1-c1ccc(cc1)C(F)(F)F |r|
Show InChI InChI=1S/C21H19F3N2O2/c1-12-19(14-5-8-15(9-6-14)21(22,23)24)28-20(25-12)26-18-4-2-3-13-7-10-16(27)11-17(13)18/h2-6,8-9,16,27H,7,10-11H2,1H3,(H,25,26)/t16-/m0/s1
Reactome pathway
n/an/a 4.80n/an/an/an/an/an/a
Abbott Laboratories
Curated by ChEMBL
Assay Description
Antagonist activity at human recombinant TRPV1 receptor expressed in human 1321 cells assessed as inhibition of capsaicin-induced in intracellular ca...
Bioorg Med Chem 18: 4821-9 (2011)
Article DOI: 10.1016/j.bmc.2010.04.099
BindingDB Entry DOI: 10.7270/Q27H1KJJ