BDBM50321880 (R,S)-1-(5-chloro-1H-indol-1-yl)propan-2-amine::2-(5-Chloro-indol-1-yl)-1-methyl-ethylamine::CHEMBL328844
SMILES: CC(N)Cn1ccc2cc(Cl)ccc12
InChI Key: InChIKey=XXCLNSYNUQMDML-UHFFFAOYSA-N
Data: 4 KI  1 EC50
Activity Spreadsheet -- Enzyme Inhibition Constant Data from BindingDB
Found 5 hits for monomerid = 50321880
Trg + Lig
Ki
nM
ΔG°
kcal/mole
IC50
nM
Kd
nM
EC50/IC50
nM
koff
s-1
kon
M-1s-1
pHTemp
°C
5-hydroxytryptamine receptor 2C
(Homo sapiens (Human))
BDBM50321880
((R,S)-1-(5-chloro-1H-indol-1-yl)propan-2-amine | 2...)
Show SMILES CC(N)Cn1ccc2cc(Cl)ccc12
Show InChI InChI=1S/C11H13ClN2/c1-8(13)7-14-5-4-9-6-10(12)2-3-11(9)14/h2-6,8H,7,13H2,1H3
Reactome pathway
7.90n/an/an/an/an/an/an/an/a
F. Hoffmann-La Roche Inc
Curated by ChEMBL
Assay Description
Binding affinity against human 5-hydroxytryptamine 2C receptor using displacement of [3H]DOB
J Med Chem 40: 2762-9 (1997)
Article DOI: 10.1021/jm970030l
BindingDB Entry DOI: 10.7270/Q270845Q
5-hydroxytryptamine receptor 2C
(Homo sapiens (Human))
BDBM50321880
((R,S)-1-(5-chloro-1H-indol-1-yl)propan-2-amine | 2...)
Show SMILES CC(N)Cn1ccc2cc(Cl)ccc12
Show InChI InChI=1S/C11H13ClN2/c1-8(13)7-14-5-4-9-6-10(12)2-3-11(9)14/h2-6,8H,7,13H2,1H3
Reactome pathway
7.90n/an/an/an/an/an/an/an/a
University of North Texas Health Science Center
Curated by ChEMBL
Assay Description
Displacement of [3H]mesulergine from human cloned 5HT2C receptor expressed in HEK293 cells after 90 mins by liquid scintillation counting
Bioorg Med Chem 18: 4783-92 (2011)
Article DOI: 10.1016/j.bmc.2010.05.017
BindingDB Entry DOI: 10.7270/Q2V69KJ2
5-hydroxytryptamine receptor 2A
(Homo sapiens (Human))
BDBM50321880
((R,S)-1-(5-chloro-1H-indol-1-yl)propan-2-amine | 2...)
Show SMILES CC(N)Cn1ccc2cc(Cl)ccc12
Show InChI InChI=1S/C11H13ClN2/c1-8(13)7-14-5-4-9-6-10(12)2-3-11(9)14/h2-6,8H,7,13H2,1H3
Reactome pathway
200n/an/an/an/an/an/an/an/a
University of North Texas Health Science Center
Curated by ChEMBL
Assay Description
Displacement of [3H]methylspiperone from human cloned 5HT2A receptor expressed in HEK293 cells after 90 mins by liquid scintillation counting
Bioorg Med Chem 18: 4783-92 (2011)
Article DOI: 10.1016/j.bmc.2010.05.017
BindingDB Entry DOI: 10.7270/Q2V69KJ2
5-hydroxytryptamine receptor 2A
(Homo sapiens (Human))
BDBM50321880
((R,S)-1-(5-chloro-1H-indol-1-yl)propan-2-amine | 2...)
Show SMILES CC(N)Cn1ccc2cc(Cl)ccc12
Show InChI InChI=1S/C11H13ClN2/c1-8(13)7-14-5-4-9-6-10(12)2-3-11(9)14/h2-6,8H,7,13H2,1H3
Reactome pathway
200n/an/an/an/an/an/an/an/a
F. Hoffmann-La Roche Inc
Curated by ChEMBL
Assay Description
Binding affinity against human 5-hydroxytryptamine 2A receptor using displacement of [3H]5-HT
J Med Chem 40: 2762-9 (1997)
Article DOI: 10.1021/jm970030l
BindingDB Entry DOI: 10.7270/Q270845Q
5-hydroxytryptamine receptor 2C
(Rattus norvegicus (Rat))
BDBM50321880
((R,S)-1-(5-chloro-1H-indol-1-yl)propan-2-amine | 2...)
Show SMILES CC(N)Cn1ccc2cc(Cl)ccc12
Show InChI InChI=1S/C11H13ClN2/c1-8(13)7-14-5-4-9-6-10(12)2-3-11(9)14/h2-6,8H,7,13H2,1H3
n/an/an/an/a 2.00E+3n/an/an/an/a
F. Hoffmann-La Roche Inc
Curated by ChEMBL
Assay Description
Efficacy (pEC50) was evaluated for 5-HT2C receptor-mediated stimulation of IP3 formation in vitro in choroid plexus of the rat
J Med Chem 40: 2762-9 (1997)
Article DOI: 10.1021/jm970030l
BindingDB Entry DOI: 10.7270/Q270845Q