BDBM50321944 4-(9-benzyl-9H-purin-6-yl)morpholine::CHEMBL1171261
SMILES: C(c1ccccc1)n1cnc2c(ncnc12)N1CCOCC1
InChI Key: InChIKey=WDNWCHAWRTVFRV-UHFFFAOYSA-N
Data: 1 IC50
Activity Spreadsheet -- Enzyme Inhibition Constant Data from BindingDB
Found 1 hit for monomerid = 50321944
Trg + Lig
Ki
nM
ΔG°
kcal/mole
IC50
nM
Kd
nM
EC50/IC50
nM
koff
s-1
kon
M-1s-1
pHTemp
°C
Proto-oncogene tyrosine-protein kinase Src
(Homo sapiens (Human))
BDBM50321944
(4-(9-benzyl-9H-purin-6-yl)morpholine | CHEMBL11712...)
Show SMILES C(c1ccccc1)n1cnc2c(ncnc12)N1CCOCC1
Show InChI InChI=1S/C16H17N5O/c1-2-4-13(5-3-1)10-21-12-19-14-15(17-11-18-16(14)21)20-6-8-22-9-7-20/h1-5,11-12H,6-10H2
n/an/a>1.00E+4n/an/an/an/an/an/a
Chinese Academy of Sciences
Curated by ChEMBL
Assay Description
Inhibition cSRC
Bioorg Med Chem 18: 4615-24 (2011)
Article DOI: 10.1016/j.bmc.2010.05.032
BindingDB Entry DOI: 10.7270/Q26H4JCQ