BDBM50321945 9-benzyl-N-(4-bromophenyl)-9H-purin-6-amine::CHEMBL1173318
SMILES: Brc1ccc(Nc2ncnc3n(Cc4ccccc4)cnc23)cc1
InChI Key: InChIKey=LGBRLFNQMISESG-UHFFFAOYSA-N
Data: 1 IC50
Activity Spreadsheet -- Enzyme Inhibition Constant Data from BindingDB
Found 1 hit for monomerid = 50321945
Trg + Lig
Ki
nM
ΔG°
kcal/mole
IC50
nM
Kd
nM
EC50/IC50
nM
koff
s-1
kon
M-1s-1
pHTemp
°C
Proto-oncogene tyrosine-protein kinase Src
(Homo sapiens (Human))
BDBM50321945
(9-benzyl-N-(4-bromophenyl)-9H-purin-6-amine | CHEM...)
Show SMILES Brc1ccc(Nc2ncnc3n(Cc4ccccc4)cnc23)cc1
Show InChI InChI=1S/C18H14BrN5/c19-14-6-8-15(9-7-14)23-17-16-18(21-11-20-17)24(12-22-16)10-13-4-2-1-3-5-13/h1-9,11-12H,10H2,(H,20,21,23)
n/an/a>1.00E+4n/an/an/an/an/an/a
Chinese Academy of Sciences
Curated by ChEMBL
Assay Description
Inhibition cSRC
Bioorg Med Chem 18: 4615-24 (2011)
Article DOI: 10.1016/j.bmc.2010.05.032
BindingDB Entry DOI: 10.7270/Q26H4JCQ