BDBM50321953 CHEMBL1173736::N-(3-Methylphenyl)-2-(piperazin-1-yl)-9H-purin-6-amine
SMILES: Cc1cccc(Nc2nc(nc3nc[nH]c23)N2CCNCC2)c1
InChI Key: InChIKey=XFSOUPOWXHXIQC-UHFFFAOYSA-N
Data: 1 IC50
Activity Spreadsheet -- Enzyme Inhibition Constant Data from BindingDB
Found 1 hit for monomerid = 50321953
Trg + Lig
Ki
nM
ΔG°
kcal/mole
IC50
nM
Kd
nM
EC50/IC50
nM
koff
s-1
kon
M-1s-1
pHTemp
°C
Proto-oncogene tyrosine-protein kinase Src
(Homo sapiens (Human))
BDBM50321953
(CHEMBL1173736 | N-(3-Methylphenyl)-2-(piperazin-1-...)
Show SMILES Cc1cccc(Nc2nc(nc3nc[nH]c23)N2CCNCC2)c1
Show InChI InChI=1S/C16H19N7/c1-11-3-2-4-12(9-11)20-15-13-14(19-10-18-13)21-16(22-15)23-7-5-17-6-8-23/h2-4,9-10,17H,5-8H2,1H3,(H2,18,19,20,21,22)
n/an/a 2.42E+3n/an/an/an/an/an/a
Chinese Academy of Sciences
Curated by ChEMBL
Assay Description
Inhibition cSRC
Bioorg Med Chem 18: 4615-24 (2011)
Article DOI: 10.1016/j.bmc.2010.05.032
BindingDB Entry DOI: 10.7270/Q26H4JCQ