BDBM50321967 CHEMBL1173485::N-(3-Methylphenyl)-2-morpholino-9H-purin-6-amine
SMILES: Cc1cccc(Nc2nc(nc3nc[nH]c23)N2CCOCC2)c1
InChI Key: InChIKey=QFEFZVFORPZKGX-UHFFFAOYSA-N
Data: 1 IC50
Activity Spreadsheet -- Enzyme Inhibition Constant Data from BindingDB
Found 1 hit for monomerid = 50321967
Trg + Lig
Ki
nM
ΔG°
kcal/mole
IC50
nM
Kd
nM
EC50/IC50
nM
koff
s-1
kon
M-1s-1
pHTemp
°C
Proto-oncogene tyrosine-protein kinase Src
(Homo sapiens (Human))
BDBM50321967
(CHEMBL1173485 | N-(3-Methylphenyl)-2-morpholino-9H...)
Show SMILES Cc1cccc(Nc2nc(nc3nc[nH]c23)N2CCOCC2)c1
Show InChI InChI=1S/C16H18N6O/c1-11-3-2-4-12(9-11)19-15-13-14(18-10-17-13)20-16(21-15)22-5-7-23-8-6-22/h2-4,9-10H,5-8H2,1H3,(H2,17,18,19,20,21)
n/an/a 830n/an/an/an/an/an/a
Chinese Academy of Sciences
Curated by ChEMBL
Assay Description
Inhibition cSRC
Bioorg Med Chem 18: 4615-24 (2011)
Article DOI: 10.1016/j.bmc.2010.05.032
BindingDB Entry DOI: 10.7270/Q26H4JCQ