BDBM50321969 CHEMBL1173552::N-(4-Bromophenyl)-2-morpholino-9H-purin-6-amine
SMILES: Brc1ccc(Nc2nc(nc3nc[nH]c23)N2CCOCC2)cc1
InChI Key: InChIKey=WWPNENPQTCFENR-UHFFFAOYSA-N
Data: 1 IC50
Activity Spreadsheet -- Enzyme Inhibition Constant Data from BindingDB
Found 1 hit for monomerid = 50321969
Trg + Lig
Ki
nM
ΔG°
kcal/mole
IC50
nM
Kd
nM
EC50/IC50
nM
koff
s-1
kon
M-1s-1
pHTemp
°C
Proto-oncogene tyrosine-protein kinase Src
(Homo sapiens (Human))
BDBM50321969
(CHEMBL1173552 | N-(4-Bromophenyl)-2-morpholino-9H-...)
Show SMILES Brc1ccc(Nc2nc(nc3nc[nH]c23)N2CCOCC2)cc1
Show InChI InChI=1S/C15H15BrN6O/c16-10-1-3-11(4-2-10)19-14-12-13(18-9-17-12)20-15(21-14)22-5-7-23-8-6-22/h1-4,9H,5-8H2,(H2,17,18,19,20,21)
n/an/a 450n/an/an/an/an/an/a
Chinese Academy of Sciences
Curated by ChEMBL
Assay Description
Inhibition cSRC
Bioorg Med Chem 18: 4615-24 (2011)
Article DOI: 10.1016/j.bmc.2010.05.032
BindingDB Entry DOI: 10.7270/Q26H4JCQ