BDBM50322047 2,4-Dimethoxy-4'-amino-trans-stilbene::CHEMBL1170662
SMILES: COc1ccc(\C=C\c2ccc(N)cc2)c(OC)c1
InChI Key: InChIKey=CPBHGSOSBBDXHN-ZZXKWVIFSA-N
Data: 1 IC50
Activity Spreadsheet -- Enzyme Inhibition Constant Data from BindingDB
Found 1 hit for monomerid = 50322047
Trg + Lig
Ki
nM
ΔG°
kcal/mole
IC50
nM
Kd
nM
EC50/IC50
nM
koff
s-1
kon
M-1s-1
pHTemp
°C
Cytochrome P450 19A1
(Homo sapiens (Human))
BDBM50322047
(2,4-Dimethoxy-4'-amino-trans-stilbene | CHEMBL1170...)
Show SMILES COc1ccc(\C=C\c2ccc(N)cc2)c(OC)c1
Show InChI InChI=1S/C16H17NO2/c1-18-15-10-7-13(16(11-15)19-2)6-3-12-4-8-14(17)9-5-12/h3-11H,17H2,1-2H3/b6-3+
Reactome pathway
n/an/a 760n/an/an/an/an/an/a
Purdue University
Curated by ChEMBL
Assay Description
Inhibition of human aromatase preincubated with NADP+ for 10 mins before substrate addition measured after 30 mins
Bioorg Med Chem 18: 5352-66 (2010)
Article DOI: 10.1016/j.bmc.2010.05.042
BindingDB Entry DOI: 10.7270/Q2PK0H4P