null
SMILES: CCCCC(=O)Nc1ncnc2nc([nH]c12)-c1cccc(c1)C#N
InChI Key: InChIKey=FKLAKSOWIZORFH-UHFFFAOYSA-N
Activity Spreadsheet -- Enzyme Inhibition Constant Data from BindingDB
Found 1 hit for monomerid = 50322825
Trg + Lig
Ki
nM
ΔG°
kcal/mole
IC50
nM
Kd
nM
EC50/IC50
nM
koff
s-1
kon
M-1s-1
pHTemp
°C
Glycogen synthase kinase-3 beta
(Homo sapiens (Human))
BDBM50322825
(CHEMBL1210476 | N-(8-(3-cyanophenyl)-9H-purin-6-yl...)
Show SMILES CCCCC(=O)Nc1ncnc2nc([nH]c12)-c1cccc(c1)C#N
Show InChI InChI=1S/C17H16N6O/c1-2-3-7-13(24)21-16-14-17(20-10-19-16)23-15(22-14)12-6-4-5-11(8-12)9-18/h4-6,8,10H,2-3,7H2,1H3,(H2,19,20,21,22,23,24)
NCI pathway
Reactome pathway
n/an/a 1.22E+3n/an/an/an/an/an/a
Centre Universitaire
Curated by ChEMBL
Assay Description
Inhibition of human GSK3beta
Eur J Med Chem 45: 3389-93 (2010)
Article DOI: 10.1016/j.ejmech.2010.04.026
BindingDB Entry DOI: 10.7270/Q2TH8MWC