BDBM50322877 CHEMBL1210329::N-((1S,2R)-3-(((1S)-2-(CYCLOHEXYLAMINO)-1-METHYL-2-OXOETHYL)AMINO)-2-HYDROXY-1-( PHENYLMETHYL)PROPYL)-3-((METHYLSULFONYL)(PHENYL)AMINO) BENZAMIDE::N-((2S,3R)-4-((S)-1-(cyclohexylamino)-1-oxopropan-2-ylamino)-3-hydroxy-1-phenylbutan-2-yl)-3-(N-phenylmethylsulfonamido)benzamide
SMILES: C[C@H](NC[C@@H](O)[C@H](Cc1ccccc1)NC(=O)c1cccc(c1)N(c1ccccc1)S(C)(=O)=O)C(=O)NC1CCCCC1
InChI Key: InChIKey=PSSKPAZTPVDDNS-RJSONGRPSA-N
Data: 5 IC50
PDB links: 1 PDB ID matches this monomer.
Activity Spreadsheet -- Enzyme Inhibition Constant Data from BindingDB
Found 5 hits for monomerid = 50322877
Trg + Lig
Ki
nM
ΔG°
kcal/mole
IC50
nM
Kd
nM
EC50/IC50
nM
koff
s-1
kon
M-1s-1
pHTemp
°C
Beta-secretase 1
(Homo sapiens (Human))
BDBM50322877
(CHEMBL1210329 | N-((1S,2R)-3-(((1S)-2-(CYCLOHEXYLA...)
Show SMILES C[C@H](NC[C@@H](O)[C@H](Cc1ccccc1)NC(=O)c1cccc(c1)N(c1ccccc1)S(C)(=O)=O)C(=O)NC1CCCCC1 |r|
Show InChI InChI=1S/C33H42N4O5S/c1-24(32(39)35-27-16-8-4-9-17-27)34-23-31(38)30(21-25-13-6-3-7-14-25)36-33(40)26-15-12-20-29(22-26)37(43(2,41)42)28-18-10-5-11-19-28/h3,5-7,10-15,18-20,22,24,27,30-31,34,38H,4,8-9,16-17,21,23H2,1-2H3,(H,35,39)(H,36,40)/t24-,30-,31+/m0/s1
n/an/a 570n/an/an/an/an/an/a
GlaxoSmithKline R&D
Curated by ChEMBL
Assay Description
Inhibition of BACE1 assessed as inhibition of amyloid beta-40 production by cell based assay
Bioorg Med Chem Lett 20: 4639-44 (2010)
Article DOI: 10.1016/j.bmcl.2010.05.111
BindingDB Entry DOI: 10.7270/Q2RB75K7
3D
3D Structure (crystal)
Beta-secretase 1
(Homo sapiens (Human))
BDBM50322877
(CHEMBL1210329 | N-((1S,2R)-3-(((1S)-2-(CYCLOHEXYLA...)
Show SMILES C[C@H](NC[C@@H](O)[C@H](Cc1ccccc1)NC(=O)c1cccc(c1)N(c1ccccc1)S(C)(=O)=O)C(=O)NC1CCCCC1 |r|
Show InChI InChI=1S/C33H42N4O5S/c1-24(32(39)35-27-16-8-4-9-17-27)34-23-31(38)30(21-25-13-6-3-7-14-25)36-33(40)26-15-12-20-29(22-26)37(43(2,41)42)28-18-10-5-11-19-28/h3,5-7,10-15,18-20,22,24,27,30-31,34,38H,4,8-9,16-17,21,23H2,1-2H3,(H,35,39)(H,36,40)/t24-,30-,31+/m0/s1
n/an/a 15n/an/an/an/an/an/a
GlaxoSmithKline R&D
Curated by ChEMBL
Assay Description
Inhibition of BACE1
Bioorg Med Chem Lett 20: 4639-44 (2010)
Article DOI: 10.1016/j.bmcl.2010.05.111
BindingDB Entry DOI: 10.7270/Q2RB75K7
3D
3D Structure (crystal)
Beta-secretase 2
(Homo sapiens (Human))
BDBM50322877
(CHEMBL1210329 | N-((1S,2R)-3-(((1S)-2-(CYCLOHEXYLA...)
Show SMILES C[C@H](NC[C@@H](O)[C@H](Cc1ccccc1)NC(=O)c1cccc(c1)N(c1ccccc1)S(C)(=O)=O)C(=O)NC1CCCCC1 |r|
Show InChI InChI=1S/C33H42N4O5S/c1-24(32(39)35-27-16-8-4-9-17-27)34-23-31(38)30(21-25-13-6-3-7-14-25)36-33(40)26-15-12-20-29(22-26)37(43(2,41)42)28-18-10-5-11-19-28/h3,5-7,10-15,18-20,22,24,27,30-31,34,38H,4,8-9,16-17,21,23H2,1-2H3,(H,35,39)(H,36,40)/t24-,30-,31+/m0/s1
n/an/a 655n/an/an/an/an/an/a
GlaxoSmithKline R&D
Curated by ChEMBL
Assay Description
Inhibition of BACE2
Bioorg Med Chem Lett 20: 4639-44 (2010)
Article DOI: 10.1016/j.bmcl.2010.05.111
BindingDB Entry DOI: 10.7270/Q2RB75K7
Cathepsin D
(Homo sapiens (Human))
BDBM50322877
(CHEMBL1210329 | N-((1S,2R)-3-(((1S)-2-(CYCLOHEXYLA...)
Show SMILES C[C@H](NC[C@@H](O)[C@H](Cc1ccccc1)NC(=O)c1cccc(c1)N(c1ccccc1)S(C)(=O)=O)C(=O)NC1CCCCC1 |r|
Show InChI InChI=1S/C33H42N4O5S/c1-24(32(39)35-27-16-8-4-9-17-27)34-23-31(38)30(21-25-13-6-3-7-14-25)36-33(40)26-15-12-20-29(22-26)37(43(2,41)42)28-18-10-5-11-19-28/h3,5-7,10-15,18-20,22,24,27,30-31,34,38H,4,8-9,16-17,21,23H2,1-2H3,(H,35,39)(H,36,40)/t24-,30-,31+/m0/s1
NCI pathway
Reactome pathway
n/an/a 660n/an/an/an/an/an/a
GlaxoSmithKline R&D
Curated by ChEMBL
Assay Description
Inhibition of Cathepsin D
Bioorg Med Chem Lett 20: 4639-44 (2010)
Article DOI: 10.1016/j.bmcl.2010.05.111
BindingDB Entry DOI: 10.7270/Q2RB75K7
Beta-secretase 1
(Homo sapiens (Human))
BDBM50322877
(CHEMBL1210329 | N-((1S,2R)-3-(((1S)-2-(CYCLOHEXYLA...)
Show SMILES C[C@H](NC[C@@H](O)[C@H](Cc1ccccc1)NC(=O)c1cccc(c1)N(c1ccccc1)S(C)(=O)=O)C(=O)NC1CCCCC1 |r|
Show InChI InChI=1S/C33H42N4O5S/c1-24(32(39)35-27-16-8-4-9-17-27)34-23-31(38)30(21-25-13-6-3-7-14-25)36-33(40)26-15-12-20-29(22-26)37(43(2,41)42)28-18-10-5-11-19-28/h3,5-7,10-15,18-20,22,24,27,30-31,34,38H,4,8-9,16-17,21,23H2,1-2H3,(H,35,39)(H,36,40)/t24-,30-,31+/m0/s1
n/an/a 510n/an/an/an/an/an/a
GlaxoSmithKline R&D
Curated by ChEMBL
Assay Description
Inhibition of BACE1 assessed as inhibition of amyloid beta-42 production by cell based assay
Bioorg Med Chem Lett 20: 4639-44 (2010)
Article DOI: 10.1016/j.bmcl.2010.05.111
BindingDB Entry DOI: 10.7270/Q2RB75K7
3D
3D Structure (crystal)