BDBM50322919 4-(4-(3-(4-methylpiperazin-1-yl)propoxy)-3-(trifluoromethyl)phenyl)pyrimidine-2-carbonitrile::CHEMBL1209146
SMILES: CN1CCN(CCCOc2ccc(cc2C(F)(F)F)-c2ccnc(n2)C#N)CC1
InChI Key: InChIKey=LZLJBBHMBQJUSF-UHFFFAOYSA-N
Data: 2 IC50
Activity Spreadsheet -- Enzyme Inhibition Constant Data from BindingDB
Found 2 hits for monomerid = 50322919
Trg + Lig
Ki
nM
ΔG°
kcal/mole
IC50
nM
Kd
nM
EC50/IC50
nM
koff
s-1
kon
M-1s-1
pHTemp
°C
Cathepsin K
(Homo sapiens (Human))
BDBM50322919
(4-(4-(3-(4-methylpiperazin-1-yl)propoxy)-3-(triflu...)
Show SMILES CN1CCN(CCCOc2ccc(cc2C(F)(F)F)-c2ccnc(n2)C#N)CC1
Show InChI InChI=1S/C20H22F3N5O/c1-27-8-10-28(11-9-27)7-2-12-29-18-4-3-15(13-16(18)20(21,22)23)17-5-6-25-19(14-24)26-17/h3-6,13H,2,7-12H2,1H3
Reactome pathway
n/an/a 13n/an/an/an/an/an/a
Merck Research Laboratories
Curated by ChEMBL
Assay Description
Inhibition of human cathepsin K by fluorescence assay
Bioorg Med Chem Lett 20: 4507-10 (2010)
Article DOI: 10.1016/j.bmcl.2010.06.043
BindingDB Entry DOI: 10.7270/Q2SJ1KTF
Cathepsin S
(Homo sapiens (Human))
BDBM50322919
(4-(4-(3-(4-methylpiperazin-1-yl)propoxy)-3-(triflu...)
Show SMILES CN1CCN(CCCOc2ccc(cc2C(F)(F)F)-c2ccnc(n2)C#N)CC1
Show InChI InChI=1S/C20H22F3N5O/c1-27-8-10-28(11-9-27)7-2-12-29-18-4-3-15(13-16(18)20(21,22)23)17-5-6-25-19(14-24)26-17/h3-6,13H,2,7-12H2,1H3
Reactome pathway
n/an/a 1.30n/an/an/an/an/an/a
Merck Research Laboratories
Curated by ChEMBL
Assay Description
Inhibition of human cathepsin S by fluorescence assay
Bioorg Med Chem Lett 20: 4507-10 (2010)
Article DOI: 10.1016/j.bmcl.2010.06.043
BindingDB Entry DOI: 10.7270/Q2SJ1KTF