null
SMILES: CC[C@H](NC(=O)N1CCC2(CC1)C(N(C2=O)c1cccc(F)c1)c1ccc(Cl)cc1)c1ccccc1
InChI Key: InChIKey=APKFLGPFPCGCNW-PMCHYTPCSA-N
Activity Spreadsheet -- Enzyme Inhibition Constant Data from BindingDB
Found 1 hit for monomerid = 50322932
Trg + Lig
Ki
nM
ΔG°
kcal/mole
IC50
nM
Kd
nM
EC50/IC50
nM
koff
s-1
kon
M-1s-1
pHTemp
°C
Voltage-dependent T-type calcium channel subunit alpha-1H
(Homo sapiens (Human))
BDBM50322932
(1-(4-chlorophenyl)-2-(3-fluorophenyl)-3-oxo-N-((S)...)
Show SMILES CC[C@H](NC(=O)N1CCC2(CC1)C(N(C2=O)c1cccc(F)c1)c1ccc(Cl)cc1)c1ccccc1 |r|
Show InChI InChI=1S/C29H29ClFN3O2/c1-2-25(20-7-4-3-5-8-20)32-28(36)33-17-15-29(16-18-33)26(21-11-13-22(30)14-12-21)34(27(29)35)24-10-6-9-23(31)19-24/h3-14,19,25-26H,2,15-18H2,1H3,(H,32,36)/t25-,26?/m0/s1
n/an/a 224n/an/an/an/an/an/a
Merck Research Laboratory
Curated by ChEMBL
Assay Description
Inhibition of human CaV3.2 expressed in HEK293 cells at -100 mV membrane potential by Ionworks HT assay
Bioorg Med Chem Lett 20: 4602-6 (2010)
Article DOI: 10.1016/j.bmcl.2010.06.012
BindingDB Entry DOI: 10.7270/Q2NS0V34