null
SMILES: CCOC(=O)N1C[C@]2(C)O[C@](C)(C1)c1c(O)n(c(O)c21)-c1ccc(C#N)c(c1)C(F)(F)F
InChI Key: InChIKey=VJTYYKXVGAQBPX-BGYRXZFFSA-N
Activity Spreadsheet -- Enzyme Inhibition Constant Data from BindingDB
Found 3 hits for monomerid = 50323023
Trg + Lig
Ki
nM
ΔG°
kcal/mole
IC50
nM
Kd
nM
EC50/IC50
nM
koff
s-1
kon
M-1s-1
pHTemp
°C
Androgen receptor
(Homo sapiens (Human))
BDBM50323023
((1S,2S,6R,7R)-4-(4-Cyano-3-trifluoromethyl-phenyl)...)
Show SMILES CCOC(=O)N1C[C@]2(C)O[C@](C)(C1)c1c(O)n(c(O)c21)-c1ccc(C#N)c(c1)C(F)(F)F |r|
Show InChI InChI=1S/C21H20F3N3O5/c1-4-31-18(30)26-9-19(2)14-15(20(3,10-26)32-19)17(29)27(16(14)28)12-6-5-11(8-25)13(7-12)21(22,23)24/h5-7,28-29H,4,9-10H2,1-3H3/t19-,20+
NCI pathway
Reactome pathway
5.70n/an/an/an/an/an/an/an/a
Bristol-Myers Squibb Company
Curated by ChEMBL
Assay Description
Displacement of [3H]DHT from AR in human MDA-MB-453 cells
Bioorg Med Chem Lett 20: 4491-5 (2010)
Article DOI: 10.1016/j.bmcl.2010.06.034
BindingDB Entry DOI: 10.7270/Q2MK6DVH
Androgen receptor
(Homo sapiens (Human))
BDBM50323023
((1S,2S,6R,7R)-4-(4-Cyano-3-trifluoromethyl-phenyl)...)
Show SMILES CCOC(=O)N1C[C@]2(C)O[C@](C)(C1)c1c(O)n(c(O)c21)-c1ccc(C#N)c(c1)C(F)(F)F |r|
Show InChI InChI=1S/C21H20F3N3O5/c1-4-31-18(30)26-9-19(2)14-15(20(3,10-26)32-19)17(29)27(16(14)28)12-6-5-11(8-25)13(7-12)21(22,23)24/h5-7,28-29H,4,9-10H2,1-3H3/t19-,20+
NCI pathway
Reactome pathway
n/an/a 65n/an/an/an/an/an/a
Bristol-Myers Squibb Company
Curated by ChEMBL
Assay Description
Antagonist activity at human wild type AR expressed in human MDA-MB-435 cells by transactivation assay
Bioorg Med Chem Lett 20: 4491-5 (2010)
Article DOI: 10.1016/j.bmcl.2010.06.034
BindingDB Entry DOI: 10.7270/Q2MK6DVH
Androgen receptor
(Homo sapiens (Human))
BDBM50323023
((1S,2S,6R,7R)-4-(4-Cyano-3-trifluoromethyl-phenyl)...)
Show SMILES CCOC(=O)N1C[C@]2(C)O[C@](C)(C1)c1c(O)n(c(O)c21)-c1ccc(C#N)c(c1)C(F)(F)F |r|
Show InChI InChI=1S/C21H20F3N3O5/c1-4-31-18(30)26-9-19(2)14-15(20(3,10-26)32-19)17(29)27(16(14)28)12-6-5-11(8-25)13(7-12)21(22,23)24/h5-7,28-29H,4,9-10H2,1-3H3/t19-,20+
NCI pathway
Reactome pathway
n/an/a 590n/an/an/an/an/an/a
Bristol-Myers Squibb Company
Curated by ChEMBL
Assay Description
Antagonist activity at wild type human AR expressed in human LNCAP cells by transactivation assay
Bioorg Med Chem Lett 20: 4491-5 (2010)
Article DOI: 10.1016/j.bmcl.2010.06.034
BindingDB Entry DOI: 10.7270/Q2MK6DVH