BDBM50323036 3-[(1S,2S,6R,7R)-4-(4-Cyano-3-trifluoromethyl-phenyl)-1,7-dimethyl-3,5-dioxo-11-oxa-4,9-diaza-tricyclo[5.3.1.0*2,6*]undec-9-yl]-benzenesulfonamide::CHEMBL1210150
SMILES: C[C@@]12CN(C[C@@](C)(O1)c1c(O)n(c(O)c21)-c1ccc(C#N)c(c1)C(F)(F)F)c1cccc(c1)S(N)(=O)=O
InChI Key: InChIKey=NHPDYQOQLBICFC-ZRZAMGCNSA-N
Data: 1 KI  2 IC50
Activity Spreadsheet -- Enzyme Inhibition Constant Data from BindingDB
Found 3 hits for monomerid = 50323036
Trg + Lig
Ki
nM
ΔG°
kcal/mole
IC50
nM
Kd
nM
EC50/IC50
nM
koff
s-1
kon
M-1s-1
pHTemp
°C
Androgen receptor
(Homo sapiens (Human))
BDBM50323036
(3-[(1S,2S,6R,7R)-4-(4-Cyano-3-trifluoromethyl-phen...)
Show SMILES C[C@@]12CN(C[C@@](C)(O1)c1c(O)n(c(O)c21)-c1ccc(C#N)c(c1)C(F)(F)F)c1cccc(c1)S(N)(=O)=O |r|
Show InChI InChI=1S/C24H21F3N4O5S/c1-22-11-30(14-4-3-5-16(8-14)37(29,34)35)12-23(2,36-22)19-18(22)20(32)31(21(19)33)15-7-6-13(10-28)17(9-15)24(25,26)27/h3-9,32-33H,11-12H2,1-2H3,(H2,29,34,35)/t22-,23+
NCI pathway
Reactome pathway
22n/an/an/an/an/an/an/an/a
Bristol-Myers Squibb Company
Curated by ChEMBL
Assay Description
Displacement of [3H]DHT from AR in human MDA-MB-453 cells
Bioorg Med Chem Lett 20: 4491-5 (2010)
Article DOI: 10.1016/j.bmcl.2010.06.034
BindingDB Entry DOI: 10.7270/Q2MK6DVH
Androgen receptor
(Homo sapiens (Human))
BDBM50323036
(3-[(1S,2S,6R,7R)-4-(4-Cyano-3-trifluoromethyl-phen...)
Show SMILES C[C@@]12CN(C[C@@](C)(O1)c1c(O)n(c(O)c21)-c1ccc(C#N)c(c1)C(F)(F)F)c1cccc(c1)S(N)(=O)=O |r|
Show InChI InChI=1S/C24H21F3N4O5S/c1-22-11-30(14-4-3-5-16(8-14)37(29,34)35)12-23(2,36-22)19-18(22)20(32)31(21(19)33)15-7-6-13(10-28)17(9-15)24(25,26)27/h3-9,32-33H,11-12H2,1-2H3,(H2,29,34,35)/t22-,23+
NCI pathway
Reactome pathway
n/an/a 37n/an/an/an/an/an/a
Bristol-Myers Squibb Company
Curated by ChEMBL
Assay Description
Antagonist activity at human wild type AR expressed in human MDA-MB-435 cells by transactivation assay
Bioorg Med Chem Lett 20: 4491-5 (2010)
Article DOI: 10.1016/j.bmcl.2010.06.034
BindingDB Entry DOI: 10.7270/Q2MK6DVH
Androgen receptor
(Homo sapiens (Human))
BDBM50323036
(3-[(1S,2S,6R,7R)-4-(4-Cyano-3-trifluoromethyl-phen...)
Show SMILES C[C@@]12CN(C[C@@](C)(O1)c1c(O)n(c(O)c21)-c1ccc(C#N)c(c1)C(F)(F)F)c1cccc(c1)S(N)(=O)=O |r|
Show InChI InChI=1S/C24H21F3N4O5S/c1-22-11-30(14-4-3-5-16(8-14)37(29,34)35)12-23(2,36-22)19-18(22)20(32)31(21(19)33)15-7-6-13(10-28)17(9-15)24(25,26)27/h3-9,32-33H,11-12H2,1-2H3,(H2,29,34,35)/t22-,23+
NCI pathway
Reactome pathway
n/an/a 337n/an/an/an/an/an/a
Bristol-Myers Squibb Company
Curated by ChEMBL
Assay Description
Antagonist activity at wild type human AR expressed in human LNCAP cells by transactivation assay
Bioorg Med Chem Lett 20: 4491-5 (2010)
Article DOI: 10.1016/j.bmcl.2010.06.034
BindingDB Entry DOI: 10.7270/Q2MK6DVH