BDBM50323042 1-(3'-Aminocarbonyl-biphenyl-3-yl)-ethanone, O-(phenylaminocarbonyl)oxime::CHEMBL1210157
SMILES: CC(=NOC(=O)Nc1ccccc1)c1cccc(c1)-c1cccc(c1)C(N)=O
InChI Key: InChIKey=WYLNZLGMCLJJQL-UHFFFAOYSA-N
Data: 1 IC50
Activity Spreadsheet -- Enzyme Inhibition Constant Data from BindingDB
Found 1 hit for monomerid = 50323042
Trg + Lig
Ki
nM
ΔG°
kcal/mole
IC50
nM
Kd
nM
EC50/IC50
nM
koff
s-1
kon
M-1s-1
pHTemp
°C
Anandamide amidohydrolase
(Mus musculus (mouse))
BDBM50323042
(1-(3'-Aminocarbonyl-biphenyl-3-yl)-ethanone, O-(ph...)
Show SMILES CC(=NOC(=O)Nc1ccccc1)c1cccc(c1)-c1cccc(c1)C(N)=O |w:2.2|
Show InChI InChI=1S/C22H19N3O3/c1-15(25-28-22(27)24-20-11-3-2-4-12-20)16-7-5-8-17(13-16)18-9-6-10-19(14-18)21(23)26/h2-14H,1H3,(H2,23,26)(H,24,27)
n/an/a 84n/an/an/an/an/an/a
Università degli Studi di Milano
Curated by ChEMBL
Assay Description
Inhibition of mouse brain FAAH assessed as conversion of [3H-ethanolamine]AEA to [3H]ethanolamine by scintillation counting
Bioorg Med Chem Lett 20: 4406-11 (2010)
Article DOI: 10.1016/j.bmcl.2010.06.050
BindingDB Entry DOI: 10.7270/Q24Q7V5B