BDBM50323057 1-(4-Thiophen-2-yl-phenyl)-ethanone, O-(phenylaminocarbonyl)oxime::CHEMBL1209977
SMILES: CC(=NOC(=O)Nc1ccccc1)c1ccc(cc1)-c1cccs1
InChI Key: InChIKey=RMLMNEUQZXHYOC-UHFFFAOYSA-N
Data: 1 IC50
Activity Spreadsheet -- Enzyme Inhibition Constant Data from BindingDB
Found 1 hit for monomerid = 50323057
Trg + Lig
Ki
nM
ΔG°
kcal/mole
IC50
nM
Kd
nM
EC50/IC50
nM
koff
s-1
kon
M-1s-1
pHTemp
°C
Anandamide amidohydrolase
(Mus musculus (mouse))
BDBM50323057
(1-(4-Thiophen-2-yl-phenyl)-ethanone, O-(phenylamin...)
Show SMILES CC(=NOC(=O)Nc1ccccc1)c1ccc(cc1)-c1cccs1 |w:2.2|
Show InChI InChI=1S/C19H16N2O2S/c1-14(21-23-19(22)20-17-6-3-2-4-7-17)15-9-11-16(12-10-15)18-8-5-13-24-18/h2-13H,1H3,(H,20,22)
n/an/a 200n/an/an/an/an/an/a
Università degli Studi di Milano
Curated by ChEMBL
Assay Description
Inhibition of mouse brain FAAH assessed as conversion of [3H-ethanolamine]AEA to [3H]ethanolamine by scintillation counting
Bioorg Med Chem Lett 20: 4406-11 (2010)
Article DOI: 10.1016/j.bmcl.2010.06.050
BindingDB Entry DOI: 10.7270/Q24Q7V5B