null
SMILES: C[C@@H](Oc1cc(sc1C(N)=O)-n1cnc2cc(ccc12)-c1ccnc(C)c1)c1ccccc1C(F)(F)F
InChI Key: InChIKey=VBZGTXLWIIYNTA-MRXNPFEDSA-N
Activity Spreadsheet -- Enzyme Inhibition Constant Data from BindingDB
Found 1 hit for monomerid = 50323124
Trg + Lig
Ki
nM
ΔG°
kcal/mole
IC50
nM
Kd
nM
EC50/IC50
nM
koff
s-1
kon
M-1s-1
pHTemp
°C
Serine/threonine-protein kinase PLK1
(Homo sapiens (Human))
BDBM50323124
((R)-5-(5-(2-methylpyridin-4-yl)-1H-benzo[d]imidazo...)
Show SMILES C[C@@H](Oc1cc(sc1C(N)=O)-n1cnc2cc(ccc12)-c1ccnc(C)c1)c1ccccc1C(F)(F)F |r|
Show InChI InChI=1S/C27H21F3N4O2S/c1-15-11-18(9-10-32-15)17-7-8-22-21(12-17)33-14-34(22)24-13-23(25(37-24)26(31)35)36-16(2)19-5-3-4-6-20(19)27(28,29)30/h3-14,16H,1-2H3,(H2,31,35)/t16-/m1/s1
NCI pathway
Reactome pathway
n/an/a 1n/an/an/an/an/an/a
GlaxoSmithKline
Curated by ChEMBL
Assay Description
Inhibition of PLK1 by SPA assay
Bioorg Med Chem Lett 20: 4587-92 (2010)
Article DOI: 10.1016/j.bmcl.2010.06.009
BindingDB Entry DOI: 10.7270/Q2MS3SZB