BDBM50323132 (R)-4-(4-(4-benzoyl-2-methylpiperazin-1-yl)phthalazin-1-yl)phenyl acetate::CHEMBL1209189
SMILES: C[C@@H]1CN(CCN1c1nnc(-c2ccc(OC(C)=O)cc2)c2ccccc12)C(=O)c1ccccc1
InChI Key: InChIKey=KBFRCAJUCXSIIS-LJQANCHMSA-N
Data: 1 IC50
Activity Spreadsheet -- Enzyme Inhibition Constant Data from BindingDB
Found 1 hit for monomerid = 50323132
Trg + Lig
Ki
nM
ΔG°
kcal/mole
IC50
nM
Kd
nM
EC50/IC50
nM
koff
s-1
kon
M-1s-1
pHTemp
°C
G-protein- coupled-like receptor Smoothened (Smo)
(Homo sapiens (Human))
BDBM50323132
((R)-4-(4-(4-benzoyl-2-methylpiperazin-1-yl)phthala...)
Show SMILES C[C@@H]1CN(CCN1c1nnc(-c2ccc(OC(C)=O)cc2)c2ccccc12)C(=O)c1ccccc1 |r|
Show InChI InChI=1S/C28H26N4O3/c1-19-18-31(28(34)22-8-4-3-5-9-22)16-17-32(19)27-25-11-7-6-10-24(25)26(29-30-27)21-12-14-23(15-13-21)35-20(2)33/h3-15,19H,16-18H2,1-2H3/t19-/m1/s1
n/an/a 3.30n/an/an/an/an/an/a
Amgen, Inc.
Curated by ChEMBL
Assay Description
Antagonist activity at human Smo receptor in HEPM cells assessed as inhibition of Gli expression after 24 hrs by quantigene assay
Bioorg Med Chem Lett 20: 4607-10 (2010)
Article DOI: 10.1016/j.bmcl.2010.06.006
BindingDB Entry DOI: 10.7270/Q2H13268