BDBM50323286 3-cyano-5-fluoro-N-m-tolylbenzamide::CHEMBL1209203
SMILES: Cc1cccc(NC(=O)c2cc(F)cc(c2)C#N)c1
InChI Key: InChIKey=JHLDQKUSWAUHCQ-UHFFFAOYSA-N
Data: 1 KI  1 IC50
Activity Spreadsheet -- Enzyme Inhibition Constant Data from BindingDB
Found 2 hits for monomerid = 50323286
Trg + Lig
Ki
nM
ΔG°
kcal/mole
IC50
nM
Kd
nM
EC50/IC50
nM
koff
s-1
kon
M-1s-1
pHTemp
°C
Metabotropic glutamate receptor 5
(Rattus norvegicus (Rat))
BDBM50323286
(3-cyano-5-fluoro-N-m-tolylbenzamide | CHEMBL120920...)
Show SMILES Cc1cccc(NC(=O)c2cc(F)cc(c2)C#N)c1
Show InChI InChI=1S/C15H11FN2O/c1-10-3-2-4-14(5-10)18-15(19)12-6-11(9-17)7-13(16)8-12/h2-8H,1H3,(H,18,19)
Reactome pathway
100n/an/an/an/an/an/an/an/a
Vanderbilt University Medical Center
Curated by ChEMBL
Assay Description
Displacement of [3H]methoxy-PEPy from rat mGlu5 receptor expressed in HEK293A cells after 60 mins by scintillation counting
Bioorg Med Chem Lett 20: 4390-4 (2010)
Article DOI: 10.1016/j.bmcl.2010.06.064
BindingDB Entry DOI: 10.7270/Q2V9888D
Metabotropic glutamate receptor 5
(Rattus norvegicus (Rat))
BDBM50323286
(3-cyano-5-fluoro-N-m-tolylbenzamide | CHEMBL120920...)
Show SMILES Cc1cccc(NC(=O)c2cc(F)cc(c2)C#N)c1
Show InChI InChI=1S/C15H11FN2O/c1-10-3-2-4-14(5-10)18-15(19)12-6-11(9-17)7-13(16)8-12/h2-8H,1H3,(H,18,19)
Reactome pathway
n/an/a 122n/an/an/an/an/an/a
Vanderbilt University Medical Center
Curated by ChEMBL
Assay Description
Antagonist activity at rat mGlu5 receptor expressed in HEK293A cells assessed as inhibition of glutamate-induced calcium mobilization
Bioorg Med Chem Lett 20: 4390-4 (2010)
Article DOI: 10.1016/j.bmcl.2010.06.064
BindingDB Entry DOI: 10.7270/Q2V9888D