BDBM50323456 (S)-(6-chloro-5-methyl-3-(2-morpholinopropan-2-yl)-3H-spiro[isobenzofuran-1,4'-piperidine]-1'-yl)((3S,4R)-4-(2,4-difluorophenyl)-1-(tetrahydro-2H-pyran-4-yl)pyrrolidin-3-yl)methanone::CHEMBL1209799
SMILES: Cc1cc2[C@H](OC3(CCN(CC3)C(=O)[C@@H]3CN(C[C@H]3c3ccc(F)cc3F)C3CCOCC3)c2cc1Cl)C(C)(C)N1CCOCC1
InChI Key: InChIKey=XDVCARASNWEHQA-FBXLTAPESA-N
Data: 1 IC50  1 EC50
Activity Spreadsheet -- Enzyme Inhibition Constant Data from BindingDB
Found 2 hits for monomerid = 50323456
Trg + Lig
Ki
nM
ΔG°
kcal/mole
IC50
nM
Kd
nM
EC50/IC50
nM
koff
s-1
kon
M-1s-1
pHTemp
°C
Melanocortin receptor 4
(Homo sapiens (Human))
BDBM50323456
((S)-(6-chloro-5-methyl-3-(2-morpholinopropan-2-yl)...)
Show SMILES Cc1cc2[C@H](OC3(CCN(CC3)C(=O)[C@@H]3CN(C[C@H]3c3ccc(F)cc3F)C3CCOCC3)c2cc1Cl)C(C)(C)N1CCOCC1 |r|
Show InChI InChI=1S/C36H46ClF2N3O4/c1-23-18-27-30(20-31(23)37)36(46-33(27)35(2,3)42-12-16-45-17-13-42)8-10-40(11-9-36)34(43)29-22-41(25-6-14-44-15-7-25)21-28(29)26-5-4-24(38)19-32(26)39/h4-5,18-20,25,28-29,33H,6-17,21-22H2,1-3H3/t28-,29+,33-/m0/s1
n/an/a 1n/an/an/an/an/an/a
Merck Research Laboratories
Curated by ChEMBL
Assay Description
Displacement of [125I]NDP-alpha-MSH from human melanocortin 4 receptor expressed in CHO cells
Bioorg Med Chem Lett 20: 4895-900 (2010)
Article DOI: 10.1016/j.bmcl.2010.06.068
BindingDB Entry DOI: 10.7270/Q2TB172P
Melanocortin receptor 4
(Homo sapiens (Human))
BDBM50323456
((S)-(6-chloro-5-methyl-3-(2-morpholinopropan-2-yl)...)
Show SMILES Cc1cc2[C@H](OC3(CCN(CC3)C(=O)[C@@H]3CN(C[C@H]3c3ccc(F)cc3F)C3CCOCC3)c2cc1Cl)C(C)(C)N1CCOCC1 |r|
Show InChI InChI=1S/C36H46ClF2N3O4/c1-23-18-27-30(20-31(23)37)36(46-33(27)35(2,3)42-12-16-45-17-13-42)8-10-40(11-9-36)34(43)29-22-41(25-6-14-44-15-7-25)21-28(29)26-5-4-24(38)19-32(26)39/h4-5,18-20,25,28-29,33H,6-17,21-22H2,1-3H3/t28-,29+,33-/m0/s1
n/an/an/an/a 0.600n/an/an/an/a
Merck Research Laboratories
Curated by ChEMBL
Assay Description
Agonist activity at human melanocortin 4 receptor expressed in CHO cells assessed as cAMP release
Bioorg Med Chem Lett 20: 4895-900 (2010)
Article DOI: 10.1016/j.bmcl.2010.06.068
BindingDB Entry DOI: 10.7270/Q2TB172P