BDBM50323610 CHEMBL1209668::N-(3-(3-bromophenyl)-4-(4-chlorophenyl)-3-methylbutan-2-yl)-2-methyl-2-(5-(trifluoromethyl)pyridin-2-yloxy) propanamide::rac-N-(3-(3-bromophenyl)-4-(4-chlorophenyl)-3-methylbutan-2-yl)-2-methyl-2-(5-(trifluoromethyl)pyridin-2-yloxy)propanamide
SMILES: CC(NC(=O)C(C)(C)Oc1ccc(cn1)C(F)(F)F)C(C)(Cc1ccc(Cl)cc1)c1cccc(Br)c1
InChI Key: InChIKey=NQPKUUOTPVNBGE-UHFFFAOYSA-N
Data: 2 IC50
Activity Spreadsheet -- Enzyme Inhibition Constant Data from BindingDB
Found 2 hits for monomerid = 50323610
Trg + Lig
Ki
nM
ΔG°
kcal/mole
IC50
nM
Kd
nM
EC50/IC50
nM
koff
s-1
kon
M-1s-1
pHTemp
°C
Cannabinoid receptor 1
(Homo sapiens (Human))
BDBM50323610
(CHEMBL1209668 | N-(3-(3-bromophenyl)-4-(4-chloroph...)
Show SMILES CC(NC(=O)C(C)(C)Oc1ccc(cn1)C(F)(F)F)C(C)(Cc1ccc(Cl)cc1)c1cccc(Br)c1
Show InChI InChI=1S/C27H27BrClF3N2O2/c1-17(34-24(35)25(2,3)36-23-13-10-20(16-33-23)27(30,31)32)26(4,19-6-5-7-21(28)14-19)15-18-8-11-22(29)12-9-18/h5-14,16-17H,15H2,1-4H3,(H,34,35)
NCI pathway
Reactome pathway
n/an/a 260n/an/an/an/an/an/a
Merck Research Laboratories
Curated by ChEMBL
Assay Description
Displacement of [3H]CP55490 from human recombinant cannabinoid CB1 receptor expressed in CHO cells
Bioorg Med Chem Lett 20: 4757-61 (2010)
Article DOI: 10.1016/j.bmcl.2010.06.127
BindingDB Entry DOI: 10.7270/Q2NK3F71
Cannabinoid receptor 1
(Homo sapiens (Human))
BDBM50323610
(CHEMBL1209668 | N-(3-(3-bromophenyl)-4-(4-chloroph...)
Show SMILES CC(NC(=O)C(C)(C)Oc1ccc(cn1)C(F)(F)F)C(C)(Cc1ccc(Cl)cc1)c1cccc(Br)c1
Show InChI InChI=1S/C27H27BrClF3N2O2/c1-17(34-24(35)25(2,3)36-23-13-10-20(16-33-23)27(30,31)32)26(4,19-6-5-7-21(28)14-19)15-18-8-11-22(29)12-9-18/h5-14,16-17H,15H2,1-4H3,(H,34,35)
NCI pathway
Reactome pathway
n/an/a 25n/an/an/an/an/an/a
Merck Research Laboratories
Curated by ChEMBL
Assay Description
Displacement of [3H]CP55490 from human recombinant cannabinoid CB1 receptor expressed in CHO cells
Bioorg Med Chem Lett 20: 4757-61 (2010)
Article DOI: 10.1016/j.bmcl.2010.06.127
BindingDB Entry DOI: 10.7270/Q2NK3F71