BDBM50323611 (+/-)-1-(3-(4-chlorobenzyl)-3-phenylazetidin-1-yl)-2-methyl-2-(5-(trifluoromethyl)pyridin-2-yloxy)propan-1-one::CHEMBL1209669
SMILES: CC(C)(Oc1ccc(cn1)C(F)(F)F)C(=O)N1CC(Cc2ccc(Cl)cc2)(C1)c1ccccc1
InChI Key: InChIKey=ZUJSEDWCKSCQLS-UHFFFAOYSA-N
Data: 1 IC50
Activity Spreadsheet -- Enzyme Inhibition Constant Data from BindingDB
Found 1 hit for monomerid = 50323611
Trg + Lig
Ki
nM
ΔG°
kcal/mole
IC50
nM
Kd
nM
EC50/IC50
nM
koff
s-1
kon
M-1s-1
pHTemp
°C
Cannabinoid receptor 1
(Homo sapiens (Human))
BDBM50323611
((+/-)-1-(3-(4-chlorobenzyl)-3-phenylazetidin-1-yl)...)
Show SMILES CC(C)(Oc1ccc(cn1)C(F)(F)F)C(=O)N1CC(Cc2ccc(Cl)cc2)(C1)c1ccccc1
Show InChI InChI=1S/C26H24ClF3N2O2/c1-24(2,34-22-13-10-20(15-31-22)26(28,29)30)23(33)32-16-25(17-32,19-6-4-3-5-7-19)14-18-8-11-21(27)12-9-18/h3-13,15H,14,16-17H2,1-2H3
NCI pathway
Reactome pathway
n/an/a 1.30E+3n/an/an/an/an/an/a
Merck Research Laboratories
Curated by ChEMBL
Assay Description
Displacement of [3H]CP55490 from human recombinant cannabinoid CB1 receptor expressed in CHO cells
Bioorg Med Chem Lett 20: 4757-61 (2010)
Article DOI: 10.1016/j.bmcl.2010.06.127
BindingDB Entry DOI: 10.7270/Q2NK3F71