BDBM50323807 6-Methoxy-7-(3-(methyl(propyl)amino)propoxy)-2-(4-methyl-1,4-diazepan-1-yl)-N-(1-methylpiperidin-4-yl)quinazolin-4-amine::CHEMBL1213902
SMILES: CCCN(C)CCCOc1cc2nc(nc(NC3CCN(C)CC3)c2cc1OC)N1CCCN(C)CC1
InChI Key: InChIKey=ZSTJJGDXIMMQRV-UHFFFAOYSA-N
Data: 2 IC50
Activity Spreadsheet -- Enzyme Inhibition Constant Data from BindingDB
Found 2 hits for monomerid = 50323807
Trg + Lig
Ki
nM
ΔG°
kcal/mole
IC50
nM
Kd
nM
EC50/IC50
nM
koff
s-1
kon
M-1s-1
pHTemp
°C
Protein G9a (G9a)
(Homo sapiens (Human))
BDBM50323807
(6-Methoxy-7-(3-(methyl(propyl)amino)propoxy)-2-(4-...)
Show SMILES CCCN(C)CCCOc1cc2nc(nc(NC3CCN(C)CC3)c2cc1OC)N1CCCN(C)CC1
Show InChI InChI=1S/C28H47N7O2/c1-6-11-32(2)13-8-19-37-26-21-24-23(20-25(26)36-5)27(29-22-9-15-34(4)16-10-22)31-28(30-24)35-14-7-12-33(3)17-18-35/h20-22H,6-19H2,1-5H3,(H,29,30,31)
n/an/a 5.10E+4n/an/an/an/an/an/a
University of North Carolina at Chapel Hill
Curated by ChEMBL
Assay Description
Activity at methyl transferase activity G9a by enzyme coupled S-adenocylehomocystein detection assay
J Med Chem 53: 5844-57 (2010)
Article DOI: 10.1021/jm100478y
BindingDB Entry DOI: 10.7270/Q2DZ08H1
Protein G9a (G9a)
(Homo sapiens (Human))
BDBM50323807
(6-Methoxy-7-(3-(methyl(propyl)amino)propoxy)-2-(4-...)
Show SMILES CCCN(C)CCCOc1cc2nc(nc(NC3CCN(C)CC3)c2cc1OC)N1CCCN(C)CC1
Show InChI InChI=1S/C28H47N7O2/c1-6-11-32(2)13-8-19-37-26-21-24-23(20-25(26)36-5)27(29-22-9-15-34(4)16-10-22)31-28(30-24)35-14-7-12-33(3)17-18-35/h20-22H,6-19H2,1-5H3,(H,29,30,31)
n/an/a 4.50E+4n/an/an/an/an/an/a
University of North Carolina at Chapel Hill
Curated by ChEMBL
Assay Description
Inhibition of methyl transferase activity of G9a assessed as inhibition of H3K9 methylation by chemiluminescence based oxygen tunneling assay
J Med Chem 53: 5844-57 (2010)
Article DOI: 10.1021/jm100478y
BindingDB Entry DOI: 10.7270/Q2DZ08H1