BDBM50323866 (S)-1-((3R,8R,14S,17S,22aS)-8-((S)-2-amino-3-(4-hydroxyphenyl)propanamido)-14-benzyl-17-butyl-4,4,7,7-tetramethyl-1,9,12,15,18-pentaoxoicosahydropyrrolo[2,1-g][1,2,5,8,11,14,17]dithiapentaazacycloicosine-3-carbonyl)-N-((S)-1-((S)-1-(3,5-bis(trifluoromethyl)benzylamino)-3-(1H-indol-3-yl)-1-oxopropan-2-ylamino)-4-methyl-1-oxopentan-2-yl)pyrrolidine-2-carboxamide::CHEMBL1214027
SMILES: CCCC[C@@H]1NC(=O)[C@H](Cc2ccccc2)NC(=O)CNC(=O)[C@@H](NC(=O)[C@@H](N)Cc2ccc(O)cc2)C(C)(C)SSC(C)(C)[C@H](NC(=O)[C@@H]2CCCN2C1=O)C(=O)N1CCC[C@H]1C(=O)N[C@@H](CC(C)C)C(=O)N[C@@H](Cc1c[nH]c2ccccc12)C(=O)NCc1cc(cc(c1)C(F)(F)F)C(F)(F)F
InChI Key: InChIKey=DKZNWZVQLFXZER-JHOFKJSISA-N
Data: 3 KI  5 IC50  2 EC50
Activity Spreadsheet -- Enzyme Inhibition Constant Data from BindingDB
Found 10 hits for monomerid = 50323866
Trg + Lig
Ki
nM
ΔG°
kcal/mole
IC50
nM
Kd
nM
EC50/IC50
nM
koff
s-1
kon
M-1s-1
pHTemp
°C
Neurokinin 1 receptor
(Homo sapiens (Human))
BDBM50323866
((S)-1-((3R,8R,14S,17S,22aS)-8-((S)-2-amino-3-(4-hy...)
Show SMILES CCCC[C@@H]1NC(=O)[C@H](Cc2ccccc2)NC(=O)CNC(=O)[C@@H](NC(=O)[C@@H](N)Cc2ccc(O)cc2)C(C)(C)SSC(C)(C)[C@H](NC(=O)[C@@H]2CCCN2C1=O)C(=O)N1CCC[C@H]1C(=O)N[C@@H](CC(C)C)C(=O)N[C@@H](Cc1c[nH]c2ccccc12)C(=O)NCc1cc(cc(c1)C(F)(F)F)C(F)(F)F |r|
Show InChI InChI=1S/C72H90F6N12O11S2/c1-8-9-20-51-67(100)89-28-15-23-56(89)65(98)88-59(70(6,7)103-102-69(4,5)58(87-60(93)49(79)33-42-24-26-47(91)27-25-42)66(99)82-39-57(92)83-53(63(96)84-51)34-41-17-11-10-12-18-41)68(101)90-29-16-22-55(90)64(97)86-52(30-40(2)3)62(95)85-54(35-44-38-80-50-21-14-13-19-48(44)50)61(94)81-37-43-31-45(71(73,74)75)36-46(32-43)72(76,77)78/h10-14,17-19,21,24-27,31-32,36,38,40,49,51-56,58-59,80,91H,8-9,15-16,20,22-23,28-30,33-35,37,39,79H2,1-7H3,(H,81,94)(H,82,99)(H,83,92)(H,84,96)(H,85,95)(H,86,97)(H,87,93)(H,88,98)/t49-,51-,52-,53-,54-,55-,56-,58+,59+/m0/s1
Reactome pathway
1.90n/an/an/an/an/an/an/an/a
University of Arizona
Curated by ChEMBL
Assay Description
Displacement of [3H]substance P frome human NK1 receptor
J Med Chem 53: 5491-501 (2010)
Article DOI: 10.1021/jm100157m
BindingDB Entry DOI: 10.7270/Q21N81BD
Neurokinin 2 receptor
(Rattus norvegicus (Rat))
BDBM50323866
((S)-1-((3R,8R,14S,17S,22aS)-8-((S)-2-amino-3-(4-hy...)
Show SMILES CCCC[C@@H]1NC(=O)[C@H](Cc2ccccc2)NC(=O)CNC(=O)[C@@H](NC(=O)[C@@H](N)Cc2ccc(O)cc2)C(C)(C)SSC(C)(C)[C@H](NC(=O)[C@@H]2CCCN2C1=O)C(=O)N1CCC[C@H]1C(=O)N[C@@H](CC(C)C)C(=O)N[C@@H](Cc1c[nH]c2ccccc12)C(=O)NCc1cc(cc(c1)C(F)(F)F)C(F)(F)F |r|
Show InChI InChI=1S/C72H90F6N12O11S2/c1-8-9-20-51-67(100)89-28-15-23-56(89)65(98)88-59(70(6,7)103-102-69(4,5)58(87-60(93)49(79)33-42-24-26-47(91)27-25-42)66(99)82-39-57(92)83-53(63(96)84-51)34-41-17-11-10-12-18-41)68(101)90-29-16-22-55(90)64(97)86-52(30-40(2)3)62(95)85-54(35-44-38-80-50-21-14-13-19-48(44)50)61(94)81-37-43-31-45(71(73,74)75)36-46(32-43)72(76,77)78/h10-14,17-19,21,24-27,31-32,36,38,40,49,51-56,58-59,80,91H,8-9,15-16,20,22-23,28-30,33-35,37,39,79H2,1-7H3,(H,81,94)(H,82,99)(H,83,92)(H,84,96)(H,85,95)(H,86,97)(H,87,93)(H,88,98)/t49-,51-,52-,53-,54-,55-,56-,58+,59+/m0/s1
Reactome pathway
26n/an/an/an/an/an/an/an/a
University of Arizona
Curated by ChEMBL
Assay Description
Displacement of [3H]substance P frome rat NK2 receptor
J Med Chem 53: 5491-501 (2010)
Article DOI: 10.1021/jm100157m
BindingDB Entry DOI: 10.7270/Q21N81BD
Mu-type opioid receptor
(Rattus norvegicus (rat))
BDBM50323866
((S)-1-((3R,8R,14S,17S,22aS)-8-((S)-2-amino-3-(4-hy...)
Show SMILES CCCC[C@@H]1NC(=O)[C@H](Cc2ccccc2)NC(=O)CNC(=O)[C@@H](NC(=O)[C@@H](N)Cc2ccc(O)cc2)C(C)(C)SSC(C)(C)[C@H](NC(=O)[C@@H]2CCCN2C1=O)C(=O)N1CCC[C@H]1C(=O)N[C@@H](CC(C)C)C(=O)N[C@@H](Cc1c[nH]c2ccccc12)C(=O)NCc1cc(cc(c1)C(F)(F)F)C(F)(F)F |r|
Show InChI InChI=1S/C72H90F6N12O11S2/c1-8-9-20-51-67(100)89-28-15-23-56(89)65(98)88-59(70(6,7)103-102-69(4,5)58(87-60(93)49(79)33-42-24-26-47(91)27-25-42)66(99)82-39-57(92)83-53(63(96)84-51)34-41-17-11-10-12-18-41)68(101)90-29-16-22-55(90)64(97)86-52(30-40(2)3)62(95)85-54(35-44-38-80-50-21-14-13-19-48(44)50)61(94)81-37-43-31-45(71(73,74)75)36-46(32-43)72(76,77)78/h10-14,17-19,21,24-27,31-32,36,38,40,49,51-56,58-59,80,91H,8-9,15-16,20,22-23,28-30,33-35,37,39,79H2,1-7H3,(H,81,94)(H,82,99)(H,83,92)(H,84,96)(H,85,95)(H,86,97)(H,87,93)(H,88,98)/t49-,51-,52-,53-,54-,55-,56-,58+,59+/m0/s1
Reactome pathway
1.00E+3n/an/an/an/an/an/an/an/a
University of Arizona
Curated by ChEMBL
Assay Description
Displacement of [3H]DPDPE from rat mu opioid receptor
J Med Chem 53: 5491-501 (2010)
Article DOI: 10.1021/jm100157m
BindingDB Entry DOI: 10.7270/Q21N81BD
Mu-type opioid receptor
(Rattus norvegicus (rat))
BDBM50323866
((S)-1-((3R,8R,14S,17S,22aS)-8-((S)-2-amino-3-(4-hy...)
Show SMILES CCCC[C@@H]1NC(=O)[C@H](Cc2ccccc2)NC(=O)CNC(=O)[C@@H](NC(=O)[C@@H](N)Cc2ccc(O)cc2)C(C)(C)SSC(C)(C)[C@H](NC(=O)[C@@H]2CCCN2C1=O)C(=O)N1CCC[C@H]1C(=O)N[C@@H](CC(C)C)C(=O)N[C@@H](Cc1c[nH]c2ccccc12)C(=O)NCc1cc(cc(c1)C(F)(F)F)C(F)(F)F |r|
Show InChI InChI=1S/C72H90F6N12O11S2/c1-8-9-20-51-67(100)89-28-15-23-56(89)65(98)88-59(70(6,7)103-102-69(4,5)58(87-60(93)49(79)33-42-24-26-47(91)27-25-42)66(99)82-39-57(92)83-53(63(96)84-51)34-41-17-11-10-12-18-41)68(101)90-29-16-22-55(90)64(97)86-52(30-40(2)3)62(95)85-54(35-44-38-80-50-21-14-13-19-48(44)50)61(94)81-37-43-31-45(71(73,74)75)36-46(32-43)72(76,77)78/h10-14,17-19,21,24-27,31-32,36,38,40,49,51-56,58-59,80,91H,8-9,15-16,20,22-23,28-30,33-35,37,39,79H2,1-7H3,(H,81,94)(H,82,99)(H,83,92)(H,84,96)(H,85,95)(H,86,97)(H,87,93)(H,88,98)/t49-,51-,52-,53-,54-,55-,56-,58+,59+/m0/s1
Reactome pathway
n/an/an/an/a 140n/an/an/an/a
University of Arizona
Curated by ChEMBL
Assay Description
Agonist activity at rat mu opioid receptor expressed in mouse HN9.10 cells assessed as [35S]GTPgammaS binding
J Med Chem 53: 5491-501 (2010)
Article DOI: 10.1021/jm100157m
BindingDB Entry DOI: 10.7270/Q21N81BD
Delta-type opioid receptor
(MOUSE)
BDBM50323866
((S)-1-((3R,8R,14S,17S,22aS)-8-((S)-2-amino-3-(4-hy...)
Show SMILES CCCC[C@@H]1NC(=O)[C@H](Cc2ccccc2)NC(=O)CNC(=O)[C@@H](NC(=O)[C@@H](N)Cc2ccc(O)cc2)C(C)(C)SSC(C)(C)[C@H](NC(=O)[C@@H]2CCCN2C1=O)C(=O)N1CCC[C@H]1C(=O)N[C@@H](CC(C)C)C(=O)N[C@@H](Cc1c[nH]c2ccccc12)C(=O)NCc1cc(cc(c1)C(F)(F)F)C(F)(F)F |r|
Show InChI InChI=1S/C72H90F6N12O11S2/c1-8-9-20-51-67(100)89-28-15-23-56(89)65(98)88-59(70(6,7)103-102-69(4,5)58(87-60(93)49(79)33-42-24-26-47(91)27-25-42)66(99)82-39-57(92)83-53(63(96)84-51)34-41-17-11-10-12-18-41)68(101)90-29-16-22-55(90)64(97)86-52(30-40(2)3)62(95)85-54(35-44-38-80-50-21-14-13-19-48(44)50)61(94)81-37-43-31-45(71(73,74)75)36-46(32-43)72(76,77)78/h10-14,17-19,21,24-27,31-32,36,38,40,49,51-56,58-59,80,91H,8-9,15-16,20,22-23,28-30,33-35,37,39,79H2,1-7H3,(H,81,94)(H,82,99)(H,83,92)(H,84,96)(H,85,95)(H,86,97)(H,87,93)(H,88,98)/t49-,51-,52-,53-,54-,55-,56-,58+,59+/m0/s1
Reactome pathway
n/an/a 1.10E+3n/an/an/an/an/an/a
University of Arizona
Curated by ChEMBL
Assay Description
Agonist activity at delta opioid receptor in mouse vas deferens assessed as inhibition of electrically-stimulated muscle contraction
J Med Chem 53: 5491-501 (2010)
Article DOI: 10.1021/jm100157m
BindingDB Entry DOI: 10.7270/Q21N81BD
Neurokinin 1 receptor
(Homo sapiens (Human))
BDBM50323866
((S)-1-((3R,8R,14S,17S,22aS)-8-((S)-2-amino-3-(4-hy...)
Show SMILES CCCC[C@@H]1NC(=O)[C@H](Cc2ccccc2)NC(=O)CNC(=O)[C@@H](NC(=O)[C@@H](N)Cc2ccc(O)cc2)C(C)(C)SSC(C)(C)[C@H](NC(=O)[C@@H]2CCCN2C1=O)C(=O)N1CCC[C@H]1C(=O)N[C@@H](CC(C)C)C(=O)N[C@@H](Cc1c[nH]c2ccccc12)C(=O)NCc1cc(cc(c1)C(F)(F)F)C(F)(F)F |r|
Show InChI InChI=1S/C72H90F6N12O11S2/c1-8-9-20-51-67(100)89-28-15-23-56(89)65(98)88-59(70(6,7)103-102-69(4,5)58(87-60(93)49(79)33-42-24-26-47(91)27-25-42)66(99)82-39-57(92)83-53(63(96)84-51)34-41-17-11-10-12-18-41)68(101)90-29-16-22-55(90)64(97)86-52(30-40(2)3)62(95)85-54(35-44-38-80-50-21-14-13-19-48(44)50)61(94)81-37-43-31-45(71(73,74)75)36-46(32-43)72(76,77)78/h10-14,17-19,21,24-27,31-32,36,38,40,49,51-56,58-59,80,91H,8-9,15-16,20,22-23,28-30,33-35,37,39,79H2,1-7H3,(H,81,94)(H,82,99)(H,83,92)(H,84,96)(H,85,95)(H,86,97)(H,87,93)(H,88,98)/t49-,51-,52-,53-,54-,55-,56-,58+,59+/m0/s1
Reactome pathway
n/an/a 4.30n/an/an/an/an/an/a
University of Arizona
Curated by ChEMBL
Assay Description
Displacement of [3H]substance P frome human NK1 receptor
J Med Chem 53: 5491-501 (2010)
Article DOI: 10.1021/jm100157m
BindingDB Entry DOI: 10.7270/Q21N81BD
Delta-type opioid receptor
(Homo sapiens (Human))
BDBM50323866
((S)-1-((3R,8R,14S,17S,22aS)-8-((S)-2-amino-3-(4-hy...)
Show SMILES CCCC[C@@H]1NC(=O)[C@H](Cc2ccccc2)NC(=O)CNC(=O)[C@@H](NC(=O)[C@@H](N)Cc2ccc(O)cc2)C(C)(C)SSC(C)(C)[C@H](NC(=O)[C@@H]2CCCN2C1=O)C(=O)N1CCC[C@H]1C(=O)N[C@@H](CC(C)C)C(=O)N[C@@H](Cc1c[nH]c2ccccc12)C(=O)NCc1cc(cc(c1)C(F)(F)F)C(F)(F)F |r|
Show InChI InChI=1S/C72H90F6N12O11S2/c1-8-9-20-51-67(100)89-28-15-23-56(89)65(98)88-59(70(6,7)103-102-69(4,5)58(87-60(93)49(79)33-42-24-26-47(91)27-25-42)66(99)82-39-57(92)83-53(63(96)84-51)34-41-17-11-10-12-18-41)68(101)90-29-16-22-55(90)64(97)86-52(30-40(2)3)62(95)85-54(35-44-38-80-50-21-14-13-19-48(44)50)61(94)81-37-43-31-45(71(73,74)75)36-46(32-43)72(76,77)78/h10-14,17-19,21,24-27,31-32,36,38,40,49,51-56,58-59,80,91H,8-9,15-16,20,22-23,28-30,33-35,37,39,79H2,1-7H3,(H,81,94)(H,82,99)(H,83,92)(H,84,96)(H,85,95)(H,86,97)(H,87,93)(H,88,98)/t49-,51-,52-,53-,54-,55-,56-,58+,59+/m0/s1
Reactome pathway
n/an/an/an/a 120n/an/an/an/a
University of Arizona
Curated by ChEMBL
Assay Description
Agonist activity at human opioid delta receptor expressed in mouse HN9.10 cells assessed as [35S]GTPgammaS binding
J Med Chem 53: 5491-501 (2010)
Article DOI: 10.1021/jm100157m
BindingDB Entry DOI: 10.7270/Q21N81BD
Delta-type opioid receptor
(Homo sapiens (Human))
BDBM50323866
((S)-1-((3R,8R,14S,17S,22aS)-8-((S)-2-amino-3-(4-hy...)
Show SMILES CCCC[C@@H]1NC(=O)[C@H](Cc2ccccc2)NC(=O)CNC(=O)[C@@H](NC(=O)[C@@H](N)Cc2ccc(O)cc2)C(C)(C)SSC(C)(C)[C@H](NC(=O)[C@@H]2CCCN2C1=O)C(=O)N1CCC[C@H]1C(=O)N[C@@H](CC(C)C)C(=O)N[C@@H](Cc1c[nH]c2ccccc12)C(=O)NCc1cc(cc(c1)C(F)(F)F)C(F)(F)F |r|
Show InChI InChI=1S/C72H90F6N12O11S2/c1-8-9-20-51-67(100)89-28-15-23-56(89)65(98)88-59(70(6,7)103-102-69(4,5)58(87-60(93)49(79)33-42-24-26-47(91)27-25-42)66(99)82-39-57(92)83-53(63(96)84-51)34-41-17-11-10-12-18-41)68(101)90-29-16-22-55(90)64(97)86-52(30-40(2)3)62(95)85-54(35-44-38-80-50-21-14-13-19-48(44)50)61(94)81-37-43-31-45(71(73,74)75)36-46(32-43)72(76,77)78/h10-14,17-19,21,24-27,31-32,36,38,40,49,51-56,58-59,80,91H,8-9,15-16,20,22-23,28-30,33-35,37,39,79H2,1-7H3,(H,81,94)(H,82,99)(H,83,92)(H,84,96)(H,85,95)(H,86,97)(H,87,93)(H,88,98)/t49-,51-,52-,53-,54-,55-,56-,58+,59+/m0/s1
Reactome pathway
n/an/a 1.38E+3n/an/an/an/an/an/a
University of Arizona
Curated by ChEMBL
Assay Description
Displacement of [3H]DPDPE from human delta opioid receptor
J Med Chem 53: 5491-501 (2010)
Article DOI: 10.1021/jm100157m
BindingDB Entry DOI: 10.7270/Q21N81BD
Mu-type opioid receptor
(Rattus norvegicus (rat))
BDBM50323866
((S)-1-((3R,8R,14S,17S,22aS)-8-((S)-2-amino-3-(4-hy...)
Show SMILES CCCC[C@@H]1NC(=O)[C@H](Cc2ccccc2)NC(=O)CNC(=O)[C@@H](NC(=O)[C@@H](N)Cc2ccc(O)cc2)C(C)(C)SSC(C)(C)[C@H](NC(=O)[C@@H]2CCCN2C1=O)C(=O)N1CCC[C@H]1C(=O)N[C@@H](CC(C)C)C(=O)N[C@@H](Cc1c[nH]c2ccccc12)C(=O)NCc1cc(cc(c1)C(F)(F)F)C(F)(F)F |r|
Show InChI InChI=1S/C72H90F6N12O11S2/c1-8-9-20-51-67(100)89-28-15-23-56(89)65(98)88-59(70(6,7)103-102-69(4,5)58(87-60(93)49(79)33-42-24-26-47(91)27-25-42)66(99)82-39-57(92)83-53(63(96)84-51)34-41-17-11-10-12-18-41)68(101)90-29-16-22-55(90)64(97)86-52(30-40(2)3)62(95)85-54(35-44-38-80-50-21-14-13-19-48(44)50)61(94)81-37-43-31-45(71(73,74)75)36-46(32-43)72(76,77)78/h10-14,17-19,21,24-27,31-32,36,38,40,49,51-56,58-59,80,91H,8-9,15-16,20,22-23,28-30,33-35,37,39,79H2,1-7H3,(H,81,94)(H,82,99)(H,83,92)(H,84,96)(H,85,95)(H,86,97)(H,87,93)(H,88,98)/t49-,51-,52-,53-,54-,55-,56-,58+,59+/m0/s1
Reactome pathway
n/an/a 2.04E+3n/an/an/an/an/an/a
University of Arizona
Curated by ChEMBL
Assay Description
Displacement of [3H]DPDPE from rat mu opioid receptor
J Med Chem 53: 5491-501 (2010)
Article DOI: 10.1021/jm100157m
BindingDB Entry DOI: 10.7270/Q21N81BD
Neurokinin 2 receptor
(Rattus norvegicus (Rat))
BDBM50323866
((S)-1-((3R,8R,14S,17S,22aS)-8-((S)-2-amino-3-(4-hy...)
Show SMILES CCCC[C@@H]1NC(=O)[C@H](Cc2ccccc2)NC(=O)CNC(=O)[C@@H](NC(=O)[C@@H](N)Cc2ccc(O)cc2)C(C)(C)SSC(C)(C)[C@H](NC(=O)[C@@H]2CCCN2C1=O)C(=O)N1CCC[C@H]1C(=O)N[C@@H](CC(C)C)C(=O)N[C@@H](Cc1c[nH]c2ccccc12)C(=O)NCc1cc(cc(c1)C(F)(F)F)C(F)(F)F |r|
Show InChI InChI=1S/C72H90F6N12O11S2/c1-8-9-20-51-67(100)89-28-15-23-56(89)65(98)88-59(70(6,7)103-102-69(4,5)58(87-60(93)49(79)33-42-24-26-47(91)27-25-42)66(99)82-39-57(92)83-53(63(96)84-51)34-41-17-11-10-12-18-41)68(101)90-29-16-22-55(90)64(97)86-52(30-40(2)3)62(95)85-54(35-44-38-80-50-21-14-13-19-48(44)50)61(94)81-37-43-31-45(71(73,74)75)36-46(32-43)72(76,77)78/h10-14,17-19,21,24-27,31-32,36,38,40,49,51-56,58-59,80,91H,8-9,15-16,20,22-23,28-30,33-35,37,39,79H2,1-7H3,(H,81,94)(H,82,99)(H,83,92)(H,84,96)(H,85,95)(H,86,97)(H,87,93)(H,88,98)/t49-,51-,52-,53-,54-,55-,56-,58+,59+/m0/s1
Reactome pathway
n/an/a 105n/an/an/an/an/an/a
University of Arizona
Curated by ChEMBL
Assay Description
Displacement of [3H]substance P frome rat NK2 receptor
J Med Chem 53: 5491-501 (2010)
Article DOI: 10.1021/jm100157m
BindingDB Entry DOI: 10.7270/Q21N81BD