null
SMILES: Nc1nc(NCCO)c(cc1C#N)C#N
InChI Key: InChIKey=HLPDOEMXQFBTQK-UHFFFAOYSA-N
Activity Spreadsheet -- Enzyme Inhibition Constant Data from BindingDB
Found 2 hits for monomerid = 50324053
Trg + Lig
Ki
nM
ΔG°
kcal/mole
IC50
nM
Kd
nM
EC50/IC50
nM
koff
s-1
kon
M-1s-1
pHTemp
°C
Carboxylic ester hydrolase
(Equus caballus (Horse))
BDBM50324053
(2-Amino-6-(2-hydroxyethylamine)pyridine-3,5-dicarb...)
Show SMILES Nc1nc(NCCO)c(cc1C#N)C#N
Show InChI InChI=1S/C9H9N5O/c10-4-6-3-7(5-11)9(13-1-2-15)14-8(6)12/h3,15H,1-2H2,(H3,12,13,14)
n/an/a>1.00E+5n/an/an/an/an/an/a
Laboratorio de Radicales Libres y Química Computacional (IQOG, CSIC)
Curated by ChEMBL
Assay Description
Inhibition of equine serum BuChE after 10 mins by Ellman's method
Bioorg Med Chem 18: 5861-72 (2010)
Article DOI: 10.1016/j.bmc.2010.06.095
BindingDB Entry DOI: 10.7270/Q23J3D5D
Acetylcholinesterase
(Electrophorus electricus (Electric eel))
BDBM50324053
(2-Amino-6-(2-hydroxyethylamine)pyridine-3,5-dicarb...)
Show SMILES Nc1nc(NCCO)c(cc1C#N)C#N
Show InChI InChI=1S/C9H9N5O/c10-4-6-3-7(5-11)9(13-1-2-15)14-8(6)12/h3,15H,1-2H2,(H3,12,13,14)
n/an/a>1.00E+5n/an/an/an/an/an/a
Laboratorio de Radicales Libres y Química Computacional (IQOG, CSIC)
Curated by ChEMBL
Assay Description
Inhibition of Electrophorus electricus AChE after 10 mins by Ellman's method
Bioorg Med Chem 18: 5861-72 (2010)
Article DOI: 10.1016/j.bmc.2010.06.095
BindingDB Entry DOI: 10.7270/Q23J3D5D