BDBM50324057 2-Amino-6-(pyrrolidin-1'-yl)-4-phenylpyridine-3,5-dicarbonitrile::CHEMBL1215029
SMILES: Nc1nc(N2CCCC2)c(C#N)c(-c2ccccc2)c1C#N
InChI Key: InChIKey=DQDILNDNGZRYFK-UHFFFAOYSA-N
Data: 2 IC50
Activity Spreadsheet -- Enzyme Inhibition Constant Data from BindingDB
Found 2 hits for monomerid = 50324057
Trg + Lig
Ki
nM
ΔG°
kcal/mole
IC50
nM
Kd
nM
EC50/IC50
nM
koff
s-1
kon
M-1s-1
pHTemp
°C
Butyrylcholinesterase (BChE)
(Equus caballus (Horse))
BDBM50324057
(2-Amino-6-(pyrrolidin-1'-yl)-4-phenylpyridine-3,5-...)
Show SMILES Nc1nc(N2CCCC2)c(C#N)c(-c2ccccc2)c1C#N
Show InChI InChI=1S/C17H15N5/c18-10-13-15(12-6-2-1-3-7-12)14(11-19)17(21-16(13)20)22-8-4-5-9-22/h1-3,6-7H,4-5,8-9H2,(H2,20,21)
n/an/a>1.00E+5n/an/an/an/an/an/a
Laboratorio de Radicales Libres y Química Computacional (IQOG, CSIC)
Curated by ChEMBL
Assay Description
Inhibition of equine serum BuChE after 10 mins by Ellman's method
Bioorg Med Chem 18: 5861-72 (2010)
Article DOI: 10.1016/j.bmc.2010.06.095
BindingDB Entry DOI: 10.7270/Q23J3D5D
Acetylcholinesterase
(Electrophorus electricus (Electric eel))
BDBM50324057
(2-Amino-6-(pyrrolidin-1'-yl)-4-phenylpyridine-3,5-...)
Show SMILES Nc1nc(N2CCCC2)c(C#N)c(-c2ccccc2)c1C#N
Show InChI InChI=1S/C17H15N5/c18-10-13-15(12-6-2-1-3-7-12)14(11-19)17(21-16(13)20)22-8-4-5-9-22/h1-3,6-7H,4-5,8-9H2,(H2,20,21)
n/an/a>1.00E+5n/an/an/an/an/an/a
Laboratorio de Radicales Libres y Química Computacional (IQOG, CSIC)
Curated by ChEMBL
Assay Description
Inhibition of Electrophorus electricus AChE after 10 mins by Ellman's method
Bioorg Med Chem 18: 5861-72 (2010)
Article DOI: 10.1016/j.bmc.2010.06.095
BindingDB Entry DOI: 10.7270/Q23J3D5D