null
SMILES: Nc1nc(NCc2ccccc2)c(C#N)c(-c2ccccc2)c1C#N
InChI Key: InChIKey=MWIMWAHNRBQFLD-UHFFFAOYSA-N
Activity Spreadsheet -- Enzyme Inhibition Constant Data from BindingDB
Found 2 hits for monomerid = 50324060
Trg + Lig
Ki
nM
ΔG°
kcal/mole
IC50
nM
Kd
nM
EC50/IC50
nM
koff
s-1
kon
M-1s-1
pHTemp
°C
Carboxylic ester hydrolase
(Equus caballus (Horse))
BDBM50324060
(2-Amino-6-benzylamino-4-phenylpyridine-3,5-dicarbo...)
Show SMILES Nc1nc(NCc2ccccc2)c(C#N)c(-c2ccccc2)c1C#N
Show InChI InChI=1S/C20H15N5/c21-11-16-18(15-9-5-2-6-10-15)17(12-22)20(25-19(16)23)24-13-14-7-3-1-4-8-14/h1-10H,13H2,(H3,23,24,25)
n/an/a>1.00E+5n/an/an/an/an/an/a
Laboratorio de Radicales Libres y Química Computacional (IQOG, CSIC)
Curated by ChEMBL
Assay Description
Inhibition of equine serum BuChE after 10 mins by Ellman's method
Bioorg Med Chem 18: 5861-72 (2010)
Article DOI: 10.1016/j.bmc.2010.06.095
BindingDB Entry DOI: 10.7270/Q23J3D5D
Acetylcholinesterase
(Electrophorus electricus (Electric eel))
BDBM50324060
(2-Amino-6-benzylamino-4-phenylpyridine-3,5-dicarbo...)
Show SMILES Nc1nc(NCc2ccccc2)c(C#N)c(-c2ccccc2)c1C#N
Show InChI InChI=1S/C20H15N5/c21-11-16-18(15-9-5-2-6-10-15)17(12-22)20(25-19(16)23)24-13-14-7-3-1-4-8-14/h1-10H,13H2,(H3,23,24,25)
n/an/a>1.00E+5n/an/an/an/an/an/a
Laboratorio de Radicales Libres y Química Computacional (IQOG, CSIC)
Curated by ChEMBL
Assay Description
Inhibition of Electrophorus electricus AChE after 10 mins by Ellman's method
Bioorg Med Chem 18: 5861-72 (2010)
Article DOI: 10.1016/j.bmc.2010.06.095
BindingDB Entry DOI: 10.7270/Q23J3D5D