BDBM50324267 (Z)-3-(2-{[5-(Indolin-1-ylsulfonyl)-2-oxoindolin-3-ylidene]-methyl}-4-oxo-4,5,6,7-tetrahydro-1H-indol-3-yl)propanoic Acid::CHEMBL1215146
SMILES: OC(=O)CCc1c(C=C2C(=O)Nc3ccc(cc23)S(=O)(=O)N2CCc3ccccc23)[nH]c2CCCC(=O)c12
InChI Key: InChIKey=NROKZPYRSOKBHT-UHFFFAOYSA-N
Data: 2 IC50
Activity Spreadsheet -- Enzyme Inhibition Constant Data from BindingDB
Found 2 hits for monomerid = 50324267
Trg + Lig
Ki
nM
ΔG°
kcal/mole
IC50
nM
Kd
nM
EC50/IC50
nM
koff
s-1
kon
M-1s-1
pHTemp
°C
Aurora kinase A
(Homo sapiens (Human))
BDBM50324267
((Z)-3-(2-{[5-(Indolin-1-ylsulfonyl)-2-oxoindolin-3...)
Show SMILES OC(=O)CCc1c(C=C2C(=O)Nc3ccc(cc23)S(=O)(=O)N2CCc3ccccc23)[nH]c2CCCC(=O)c12 |w:7.6|
Show InChI InChI=1S/C28H25N3O6S/c32-25-7-3-5-22-27(25)18(9-11-26(33)34)23(29-22)15-20-19-14-17(8-10-21(19)30-28(20)35)38(36,37)31-13-12-16-4-1-2-6-24(16)31/h1-2,4,6,8,10,14-15,29H,3,5,7,9,11-13H2,(H,30,35)(H,33,34)
NCI pathway
Reactome pathway
n/an/a 8n/an/an/an/an/an/a
Development Center for Biotechnology
Curated by ChEMBL
Assay Description
Inhibition of recombinant aurora A
J Med Chem 53: 5929-41 (2010)
Article DOI: 10.1021/jm1001869
BindingDB Entry DOI: 10.7270/Q2XS5VKS
Aurora kinase B
(Homo sapiens (Human))
BDBM50324267
((Z)-3-(2-{[5-(Indolin-1-ylsulfonyl)-2-oxoindolin-3...)
Show SMILES OC(=O)CCc1c(C=C2C(=O)Nc3ccc(cc23)S(=O)(=O)N2CCc3ccccc23)[nH]c2CCCC(=O)c12 |w:7.6|
Show InChI InChI=1S/C28H25N3O6S/c32-25-7-3-5-22-27(25)18(9-11-26(33)34)23(29-22)15-20-19-14-17(8-10-21(19)30-28(20)35)38(36,37)31-13-12-16-4-1-2-6-24(16)31/h1-2,4,6,8,10,14-15,29H,3,5,7,9,11-13H2,(H,30,35)(H,33,34)
Reactome pathway
n/an/a 292n/an/an/an/an/an/a
Development Center for Biotechnology
Curated by ChEMBL
Assay Description
Inhibition of recombinant aurora B
J Med Chem 53: 5929-41 (2010)
Article DOI: 10.1021/jm1001869
BindingDB Entry DOI: 10.7270/Q2XS5VKS