BDBM50324314 1-{3-[2-(Tetrahydropyran-4-ylamino)pyridin-4-yl][2,6]naphthyridin-1-yl}piperidine-4-carboxylic Acid(2-Pyrrolidin-1-ylethyl)-amide::CHEMBL1214860
SMILES: O=C(NCCN1CCCC1)C1CCN(CC1)c1nc(cc2cnccc12)-c1ccnc(NC2CCOCC2)c1
InChI Key: InChIKey=UAMLGEIEHRHDDB-UHFFFAOYSA-N
Data: 2 IC50
Activity Spreadsheet -- Enzyme Inhibition Constant Data from BindingDB
Found 2 hits for monomerid = 50324314
Trg + Lig
Ki
nM
ΔG°
kcal/mole
IC50
nM
Kd
nM
EC50/IC50
nM
koff
s-1
kon
M-1s-1
pHTemp
°C
Serine/threonine-protein kinase D1
(Homo sapiens (Human))
BDBM50324314
(1-{3-[2-(Tetrahydropyran-4-ylamino)pyridin-4-yl][2...)
Show SMILES O=C(NCCN1CCCC1)C1CCN(CC1)c1nc(cc2cnccc12)-c1ccnc(NC2CCOCC2)c1
Show InChI InChI=1S/C30H39N7O2/c38-30(33-11-16-36-12-1-2-13-36)22-5-14-37(15-6-22)29-26-4-9-31-21-24(26)19-27(35-29)23-3-10-32-28(20-23)34-25-7-17-39-18-8-25/h3-4,9-10,19-22,25H,1-2,5-8,11-18H2,(H,32,34)(H,33,38)
NCI pathway
Reactome pathway
n/an/a 1n/an/an/an/an/an/a
Novartis Institutes for BioMedical Research
Curated by ChEMBL
Assay Description
Inhibition of PKD1 by TR-FRET assay
J Med Chem 53: 5400-21 (2010)
Article DOI: 10.1021/jm100075z
BindingDB Entry DOI: 10.7270/Q2T153T9
Serine/threonine-protein kinase D1
(Homo sapiens (Human))
BDBM50324314
(1-{3-[2-(Tetrahydropyran-4-ylamino)pyridin-4-yl][2...)
Show SMILES O=C(NCCN1CCCC1)C1CCN(CC1)c1nc(cc2cnccc12)-c1ccnc(NC2CCOCC2)c1
Show InChI InChI=1S/C30H39N7O2/c38-30(33-11-16-36-12-1-2-13-36)22-5-14-37(15-6-22)29-26-4-9-31-21-24(26)19-27(35-29)23-3-10-32-28(20-23)34-25-7-17-39-18-8-25/h3-4,9-10,19-22,25H,1-2,5-8,11-18H2,(H,32,34)(H,33,38)
NCI pathway
Reactome pathway
n/an/a 96n/an/an/an/an/an/a
Novartis Institutes for BioMedical Research
Curated by ChEMBL
Assay Description
Inhibition of PKD1 assessed as HDAC5 neuclear export
J Med Chem 53: 5400-21 (2010)
Article DOI: 10.1021/jm100075z
BindingDB Entry DOI: 10.7270/Q2T153T9