BDBM50324316 CHEMBL1214929::N*1*-(3-Pyridin-4-yl[2,6]naphthyridin-1-yl)ethane-1,2-diamine
SMILES: NCCNc1nc(cc2cnccc12)-c1ccncc1
InChI Key: InChIKey=OBRQLJITIRIMLQ-UHFFFAOYSA-N
Data: 16 IC50
Activity Spreadsheet -- Enzyme Inhibition Constant Data from BindingDB
Found 16 hits for monomerid = 50324316
Trg + Lig
Ki
nM
ΔG°
kcal/mole
IC50
nM
Kd
nM
EC50/IC50
nM
koff
s-1
kon
M-1s-1
pHTemp
°C
Protein kinase C alpha type
(Homo sapiens (Human))
BDBM50324316
(CHEMBL1214929 | N*1*-(3-Pyridin-4-yl[2,6]naphthyri...)
Show SMILES NCCNc1nc(cc2cnccc12)-c1ccncc1
Show InChI InChI=1S/C15H15N5/c16-4-8-19-15-13-3-7-18-10-12(13)9-14(20-15)11-1-5-17-6-2-11/h1-3,5-7,9-10H,4,8,16H2,(H,19,20)
NCI pathway
Reactome pathway
n/an/a 900n/an/an/an/an/an/a
Novartis Institutes for BioMedical Research
Curated by ChEMBL
Assay Description
Inhibition of PKCalpha by TR-FRET assay
J Med Chem 53: 5400-21 (2010)
Article DOI: 10.1021/jm100075z
BindingDB Entry DOI: 10.7270/Q2T153T9
PKC alpha and beta-2
(Homo sapiens (Human))
BDBM50324316
(CHEMBL1214929 | N*1*-(3-Pyridin-4-yl[2,6]naphthyri...)
Show SMILES NCCNc1nc(cc2cnccc12)-c1ccncc1
Show InChI InChI=1S/C15H15N5/c16-4-8-19-15-13-3-7-18-10-12(13)9-14(20-15)11-1-5-17-6-2-11/h1-3,5-7,9-10H,4,8,16H2,(H,19,20)
NCI pathway
Reactome pathway
n/an/a 859n/an/an/an/an/an/a
Novartis Institutes for BioMedical Research
Curated by ChEMBL
Assay Description
Inhibition of recombinant human PKCbeta1 assessed as [33P]-ATP incorporation into tridecapeptide substrate after 60 mins by scintillation proximity a...
Bioorg Med Chem Lett 21: 7367-72 (2011)
Article DOI: 10.1016/j.bmcl.2011.10.025
BindingDB Entry DOI: 10.7270/Q22J6CZ4
Serine/threonine-protein kinase D1
(Homo sapiens (Human))
BDBM50324316
(CHEMBL1214929 | N*1*-(3-Pyridin-4-yl[2,6]naphthyri...)
Show SMILES NCCNc1nc(cc2cnccc12)-c1ccncc1
Show InChI InChI=1S/C15H15N5/c16-4-8-19-15-13-3-7-18-10-12(13)9-14(20-15)11-1-5-17-6-2-11/h1-3,5-7,9-10H,4,8,16H2,(H,19,20)
NCI pathway
Reactome pathway
n/an/a 5.42E+3n/an/an/an/an/an/a
Novartis Institutes for BioMedical Research
Curated by ChEMBL
Assay Description
Inhibition of PKD1 assessed as HDAC5 neuclear export
J Med Chem 53: 5400-21 (2010)
Article DOI: 10.1021/jm100075z
BindingDB Entry DOI: 10.7270/Q2T153T9
Protein kinase C alpha type
(Homo sapiens (Human))
BDBM50324316
(CHEMBL1214929 | N*1*-(3-Pyridin-4-yl[2,6]naphthyri...)
Show SMILES NCCNc1nc(cc2cnccc12)-c1ccncc1
Show InChI InChI=1S/C15H15N5/c16-4-8-19-15-13-3-7-18-10-12(13)9-14(20-15)11-1-5-17-6-2-11/h1-3,5-7,9-10H,4,8,16H2,(H,19,20)
NCI pathway
Reactome pathway
n/an/a 900n/an/an/an/an/an/a
Novartis Institutes for BioMedical Research
Curated by ChEMBL
Assay Description
Inhibition of recombinant human PKCalpha assessed as [33P]-ATP incorporation into tridecapeptide substrate after 60 mins by scintillation proximity a...
Bioorg Med Chem Lett 21: 7367-72 (2011)
Article DOI: 10.1016/j.bmcl.2011.10.025
BindingDB Entry DOI: 10.7270/Q22J6CZ4
Protein kinase C, eta
(Homo sapiens (Human))
BDBM50324316
(CHEMBL1214929 | N*1*-(3-Pyridin-4-yl[2,6]naphthyri...)
Show SMILES NCCNc1nc(cc2cnccc12)-c1ccncc1
Show InChI InChI=1S/C15H15N5/c16-4-8-19-15-13-3-7-18-10-12(13)9-14(20-15)11-1-5-17-6-2-11/h1-3,5-7,9-10H,4,8,16H2,(H,19,20)
NCI pathway
Reactome pathway
n/an/a 5n/an/an/an/an/an/a
Novartis Institutes for BioMedical Research
Curated by ChEMBL
Assay Description
Inhibition of recombinant human PKCeta assessed as [33P]-ATP incorporation into tridecapeptide substrate after 60 mins by scintillation proximity ass...
Bioorg Med Chem Lett 21: 7367-72 (2011)
Article DOI: 10.1016/j.bmcl.2011.10.025
BindingDB Entry DOI: 10.7270/Q22J6CZ4
Rho-associated protein kinase 1
(Homo sapiens (Human))
BDBM50324316
(CHEMBL1214929 | N*1*-(3-Pyridin-4-yl[2,6]naphthyri...)
Show SMILES NCCNc1nc(cc2cnccc12)-c1ccncc1
Show InChI InChI=1S/C15H15N5/c16-4-8-19-15-13-3-7-18-10-12(13)9-14(20-15)11-1-5-17-6-2-11/h1-3,5-7,9-10H,4,8,16H2,(H,19,20)
NCI pathway
Reactome pathway
n/an/a 30n/an/an/an/an/an/a
Novartis Horsham Research Centre
Curated by ChEMBL
Assay Description
Inhibition of ROCK-1 (unknown origin)
Bioorg Med Chem Lett 24: 4812-7 (2014)
Article DOI: 10.1016/j.bmcl.2014.09.002
BindingDB Entry DOI: 10.7270/Q2MP54VV
Rho-associated protein kinase 2
(Homo sapiens (Human))
BDBM50324316
(CHEMBL1214929 | N*1*-(3-Pyridin-4-yl[2,6]naphthyri...)
Show SMILES NCCNc1nc(cc2cnccc12)-c1ccncc1
Show InChI InChI=1S/C15H15N5/c16-4-8-19-15-13-3-7-18-10-12(13)9-14(20-15)11-1-5-17-6-2-11/h1-3,5-7,9-10H,4,8,16H2,(H,19,20)
n/an/a 26n/an/an/an/an/an/a
Novartis Horsham Research Centre
Curated by ChEMBL
Assay Description
Inhibition of human recombinant ROCK-2 using KEAKEKRQEQIAKRRRLSSLRASTSKSGGSQK as substrate after 40 mins by scintillation counting analysis
Bioorg Med Chem Lett 24: 4812-7 (2014)
Article DOI: 10.1016/j.bmcl.2014.09.002
BindingDB Entry DOI: 10.7270/Q2MP54VV
Protein kinase N1
(Homo sapiens (Human))
BDBM50324316
(CHEMBL1214929 | N*1*-(3-Pyridin-4-yl[2,6]naphthyri...)
Show SMILES NCCNc1nc(cc2cnccc12)-c1ccncc1
Show InChI InChI=1S/C15H15N5/c16-4-8-19-15-13-3-7-18-10-12(13)9-14(20-15)11-1-5-17-6-2-11/h1-3,5-7,9-10H,4,8,16H2,(H,19,20)
NCI pathway
n/an/a 7n/an/an/an/an/an/a
Novartis Horsham Research Centre
Curated by ChEMBL
Assay Description
Inhibition of PKN-1 (unknown origin)
Bioorg Med Chem Lett 24: 4812-7 (2014)
Article DOI: 10.1016/j.bmcl.2014.09.002
BindingDB Entry DOI: 10.7270/Q2MP54VV
Protein kinase N2
(Homo sapiens (Human))
BDBM50324316
(CHEMBL1214929 | N*1*-(3-Pyridin-4-yl[2,6]naphthyri...)
Show SMILES NCCNc1nc(cc2cnccc12)-c1ccncc1
Show InChI InChI=1S/C15H15N5/c16-4-8-19-15-13-3-7-18-10-12(13)9-14(20-15)11-1-5-17-6-2-11/h1-3,5-7,9-10H,4,8,16H2,(H,19,20)
NCI pathway
n/an/a 7n/an/an/an/an/an/a
Novartis Horsham Research Centre
Curated by ChEMBL
Assay Description
Inhibition of human recombinant PKN-2 using AKRRRLSSLRA as substrate after 40 mins by scintillation counting analysis
Bioorg Med Chem Lett 24: 4812-7 (2014)
Article DOI: 10.1016/j.bmcl.2014.09.002
BindingDB Entry DOI: 10.7270/Q2MP54VV
Protein kinase C, eta
(Homo sapiens (Human))
BDBM50324316
(CHEMBL1214929 | N*1*-(3-Pyridin-4-yl[2,6]naphthyri...)
Show SMILES NCCNc1nc(cc2cnccc12)-c1ccncc1
Show InChI InChI=1S/C15H15N5/c16-4-8-19-15-13-3-7-18-10-12(13)9-14(20-15)11-1-5-17-6-2-11/h1-3,5-7,9-10H,4,8,16H2,(H,19,20)
NCI pathway
Reactome pathway
n/an/a 5n/an/an/an/an/an/a
Novartis Horsham Research Centre
Curated by ChEMBL
Assay Description
Inhibition of human recombinant PKC-eta after 60 mins by 33P-ATP incorporation assay
Bioorg Med Chem Lett 24: 4812-7 (2014)
Article DOI: 10.1016/j.bmcl.2014.09.002
BindingDB Entry DOI: 10.7270/Q2MP54VV
Protein kinase C theta type
(Homo sapiens (Human))
BDBM50324316
(CHEMBL1214929 | N*1*-(3-Pyridin-4-yl[2,6]naphthyri...)
Show SMILES NCCNc1nc(cc2cnccc12)-c1ccncc1
Show InChI InChI=1S/C15H15N5/c16-4-8-19-15-13-3-7-18-10-12(13)9-14(20-15)11-1-5-17-6-2-11/h1-3,5-7,9-10H,4,8,16H2,(H,19,20)
NCI pathway
Reactome pathway
n/an/a 77n/an/an/an/an/an/a
Novartis Horsham Research Centre
Curated by ChEMBL
Assay Description
Inhibition of human recombinant PKC-theta after 60 mins by 33P-ATP incorporation assay
Bioorg Med Chem Lett 24: 4812-7 (2014)
Article DOI: 10.1016/j.bmcl.2014.09.002
BindingDB Entry DOI: 10.7270/Q2MP54VV
Protein kinase C delta type
(Homo sapiens (Human))
BDBM50324316
(CHEMBL1214929 | N*1*-(3-Pyridin-4-yl[2,6]naphthyri...)
Show SMILES NCCNc1nc(cc2cnccc12)-c1ccncc1
Show InChI InChI=1S/C15H15N5/c16-4-8-19-15-13-3-7-18-10-12(13)9-14(20-15)11-1-5-17-6-2-11/h1-3,5-7,9-10H,4,8,16H2,(H,19,20)
NCI pathway
Reactome pathway
n/an/a 20n/an/an/an/an/an/a
Novartis Institutes for BioMedical Research
Curated by ChEMBL
Assay Description
Inhibition of PKCdelta by TR-FRET assay
J Med Chem 53: 5400-21 (2010)
Article DOI: 10.1021/jm100075z
BindingDB Entry DOI: 10.7270/Q2T153T9
Protein kinase C delta type
(Homo sapiens (Human))
BDBM50324316
(CHEMBL1214929 | N*1*-(3-Pyridin-4-yl[2,6]naphthyri...)
Show SMILES NCCNc1nc(cc2cnccc12)-c1ccncc1
Show InChI InChI=1S/C15H15N5/c16-4-8-19-15-13-3-7-18-10-12(13)9-14(20-15)11-1-5-17-6-2-11/h1-3,5-7,9-10H,4,8,16H2,(H,19,20)
NCI pathway
Reactome pathway
n/an/a 20n/an/an/an/an/an/a
Novartis Institutes for BioMedical Research
Curated by ChEMBL
Assay Description
Inhibition of recombinant human PKCdelta assessed as [33P]-ATP incorporation into tridecapeptide substrate after 60 mins by scintillation proximity a...
Bioorg Med Chem Lett 21: 7367-72 (2011)
Article DOI: 10.1016/j.bmcl.2011.10.025
BindingDB Entry DOI: 10.7270/Q22J6CZ4
Protein kinase C, epsilon
(Homo sapiens (Human))
BDBM50324316
(CHEMBL1214929 | N*1*-(3-Pyridin-4-yl[2,6]naphthyri...)
Show SMILES NCCNc1nc(cc2cnccc12)-c1ccncc1
Show InChI InChI=1S/C15H15N5/c16-4-8-19-15-13-3-7-18-10-12(13)9-14(20-15)11-1-5-17-6-2-11/h1-3,5-7,9-10H,4,8,16H2,(H,19,20)
NCI pathway
Reactome pathway
n/an/a 5n/an/an/an/an/an/a
Novartis Institutes for BioMedical Research
Curated by ChEMBL
Assay Description
Inhibition of recombinant human PKCepsilon assessed as [33P]-ATP incorporation into tridecapeptide substrate after 60 mins by scintillation proximity...
Bioorg Med Chem Lett 21: 7367-72 (2011)
Article DOI: 10.1016/j.bmcl.2011.10.025
BindingDB Entry DOI: 10.7270/Q22J6CZ4
Protein kinase C theta type
(Homo sapiens (Human))
BDBM50324316
(CHEMBL1214929 | N*1*-(3-Pyridin-4-yl[2,6]naphthyri...)
Show SMILES NCCNc1nc(cc2cnccc12)-c1ccncc1
Show InChI InChI=1S/C15H15N5/c16-4-8-19-15-13-3-7-18-10-12(13)9-14(20-15)11-1-5-17-6-2-11/h1-3,5-7,9-10H,4,8,16H2,(H,19,20)
NCI pathway
Reactome pathway
n/an/a 77n/an/an/an/an/an/a
Novartis Institutes for BioMedical Research
Curated by ChEMBL
Assay Description
Inhibition of recombinant human PKCtheta assessed as [33P]-ATP incorporation into tridecapeptide substrate after 60 mins by scintillation proximity a...
Bioorg Med Chem Lett 21: 7367-72 (2011)
Article DOI: 10.1016/j.bmcl.2011.10.025
BindingDB Entry DOI: 10.7270/Q22J6CZ4
Serine/threonine-protein kinase D1
(Homo sapiens (Human))
BDBM50324316
(CHEMBL1214929 | N*1*-(3-Pyridin-4-yl[2,6]naphthyri...)
Show SMILES NCCNc1nc(cc2cnccc12)-c1ccncc1
Show InChI InChI=1S/C15H15N5/c16-4-8-19-15-13-3-7-18-10-12(13)9-14(20-15)11-1-5-17-6-2-11/h1-3,5-7,9-10H,4,8,16H2,(H,19,20)
NCI pathway
Reactome pathway
n/an/a 321n/an/an/an/an/an/a
Novartis Institutes for BioMedical Research
Curated by ChEMBL
Assay Description
Inhibition of PKD1 by TR-FRET assay
J Med Chem 53: 5400-21 (2010)
Article DOI: 10.1021/jm100075z
BindingDB Entry DOI: 10.7270/Q2T153T9