BDBM50324322 4-(2-cyclohexylaminopyridin-4-yl)-6-(piperazin-1-yl)-2,3-dihydropyrrolo[3,4-c]pyridin-1-one::CHEMBL1215363
SMILES: O=C1NCc2c1cc(nc2-c1ccnc(NC2CCCCC2)c1)N1CCNCC1
InChI Key: InChIKey=CJJASWBBFFHYHU-UHFFFAOYSA-N
Data: 1 IC50  1 EC50
Activity Spreadsheet -- Enzyme Inhibition Constant Data from BindingDB
Found 2 hits for monomerid = 50324322
Trg + Lig
Ki
nM
ΔG°
kcal/mole
IC50
nM
Kd
nM
EC50/IC50
nM
koff
s-1
kon
M-1s-1
pHTemp
°C
Serine/threonine-protein kinase D1
(Homo sapiens (Human))
BDBM50324322
(4-(2-cyclohexylaminopyridin-4-yl)-6-(piperazin-1-y...)
Show SMILES O=C1NCc2c1cc(nc2-c1ccnc(NC2CCCCC2)c1)N1CCNCC1
Show InChI InChI=1S/C22H28N6O/c29-22-17-13-20(28-10-8-23-9-11-28)27-21(18(17)14-25-22)15-6-7-24-19(12-15)26-16-4-2-1-3-5-16/h6-7,12-13,16,23H,1-5,8-11,14H2,(H,24,26)(H,25,29)
NCI pathway
Reactome pathway
n/an/a 1n/an/an/an/an/an/a
Novartis Institutes for BioMedical Research
Curated by ChEMBL
Assay Description
Inhibition of PKD1 by TR-FRET assay
J Med Chem 53: 5422-38 (2010)
Article DOI: 10.1021/jm100076w
BindingDB Entry DOI: 10.7270/Q2P84C2J
Serine/threonine-protein kinase D1
(Homo sapiens (Human))
BDBM50324322
(4-(2-cyclohexylaminopyridin-4-yl)-6-(piperazin-1-y...)
Show SMILES O=C1NCc2c1cc(nc2-c1ccnc(NC2CCCCC2)c1)N1CCNCC1
Show InChI InChI=1S/C22H28N6O/c29-22-17-13-20(28-10-8-23-9-11-28)27-21(18(17)14-25-22)15-6-7-24-19(12-15)26-16-4-2-1-3-5-16/h6-7,12-13,16,23H,1-5,8-11,14H2,(H,24,26)(H,25,29)
NCI pathway
Reactome pathway
n/an/an/an/a 115n/an/an/an/a
Novartis Institutes for BioMedical Research
Curated by ChEMBL
Assay Description
Inhibition of PKD1 assessed as inhibition of HDAC5 neuclear export
J Med Chem 53: 5422-38 (2010)
Article DOI: 10.1021/jm100076w
BindingDB Entry DOI: 10.7270/Q2P84C2J