BDBM50324328 2'-(2-Chlorophenylamino)-6-piperazin-1-yl[2,4']bipyridinyl-4-carboxylic Acid Amide::CHEMBL1215075
SMILES: NC(=O)c1cc(nc(c1)-c1ccnc(Nc2ccccc2Cl)c1)N1CCNCC1
InChI Key: InChIKey=VDRJYOAEHZMFEB-UHFFFAOYSA-N
Data: 2 IC50  1 EC50
Activity Spreadsheet -- Enzyme Inhibition Constant Data from BindingDB
Found 3 hits for monomerid = 50324328
Trg + Lig
Ki
nM
ΔG°
kcal/mole
IC50
nM
Kd
nM
EC50/IC50
nM
koff
s-1
kon
M-1s-1
pHTemp
°C
Serine/threonine-protein kinase D1
(Homo sapiens (Human))
BDBM50324328
(2'-(2-Chlorophenylamino)-6-piperazin-1-yl[2,4']bip...)
Show SMILES NC(=O)c1cc(nc(c1)-c1ccnc(Nc2ccccc2Cl)c1)N1CCNCC1
Show InChI InChI=1S/C21H21ClN6O/c22-16-3-1-2-4-17(16)26-19-12-14(5-6-25-19)18-11-15(21(23)29)13-20(27-18)28-9-7-24-8-10-28/h1-6,11-13,24H,7-10H2,(H2,23,29)(H,25,26)
NCI pathway
Reactome pathway
n/an/an/an/a 478n/an/an/an/a
Novartis Institutes for BioMedical Research
Curated by ChEMBL
Assay Description
Inhibition of PKD1 assessed as inhibition of HDAC5 neuclear export
J Med Chem 53: 5422-38 (2010)
Article DOI: 10.1021/jm100076w
BindingDB Entry DOI: 10.7270/Q2P84C2J
Polycystin-2
(Homo sapiens (Human))
BDBM50324328
(2'-(2-Chlorophenylamino)-6-piperazin-1-yl[2,4']bip...)
Show SMILES NC(=O)c1cc(nc(c1)-c1ccnc(Nc2ccccc2Cl)c1)N1CCNCC1
Show InChI InChI=1S/C21H21ClN6O/c22-16-3-1-2-4-17(16)26-19-12-14(5-6-25-19)18-11-15(21(23)29)13-20(27-18)28-9-7-24-8-10-28/h1-6,11-13,24H,7-10H2,(H2,23,29)(H,25,26)
Reactome pathway
n/an/a 8n/an/an/an/an/an/a
Novartis Institutes for BioMedical Research
Curated by ChEMBL
Assay Description
Inhibition of PKD2 by TR-FRET assay
J Med Chem 53: 5422-38 (2010)
Article DOI: 10.1021/jm100076w
BindingDB Entry DOI: 10.7270/Q2P84C2J
Serine/threonine-protein kinase D1
(Homo sapiens (Human))
BDBM50324328
(2'-(2-Chlorophenylamino)-6-piperazin-1-yl[2,4']bip...)
Show SMILES NC(=O)c1cc(nc(c1)-c1ccnc(Nc2ccccc2Cl)c1)N1CCNCC1
Show InChI InChI=1S/C21H21ClN6O/c22-16-3-1-2-4-17(16)26-19-12-14(5-6-25-19)18-11-15(21(23)29)13-20(27-18)28-9-7-24-8-10-28/h1-6,11-13,24H,7-10H2,(H2,23,29)(H,25,26)
NCI pathway
Reactome pathway
n/an/a 1n/an/an/an/an/an/a
Novartis Institutes for BioMedical Research
Curated by ChEMBL
Assay Description
Inhibition of PKD1 by TR-FRET assay
J Med Chem 53: 5422-38 (2010)
Article DOI: 10.1021/jm100076w
BindingDB Entry DOI: 10.7270/Q2P84C2J