BDBM50324481 CHEMBL1215446::N-(1-amino-1-oxo-3-phenylpropan-2-yl)-3,3'-dihydroxybiphenyl-4-carboxamide
SMILES: NC(=O)C(Cc1ccccc1)NC(=O)c1ccc(cc1O)-c1cccc(O)c1
InChI Key: InChIKey=AZWYITDDZJFJGD-UHFFFAOYSA-N
Data: 2 IC50
Activity Spreadsheet -- Enzyme Inhibition Constant Data from BindingDB
Found 2 hits for monomerid = 50324481
Trg + Lig
Ki
nM
ΔG°
kcal/mole
IC50
nM
Kd
nM
EC50/IC50
nM
koff
s-1
kon
M-1s-1
pHTemp
°C
Prostaglandin D Synthase
(Homo sapiens (Human))
BDBM50324481
(CHEMBL1215446 | N-(1-amino-1-oxo-3-phenylpropan-2-...)
Show SMILES NC(=O)C(Cc1ccccc1)NC(=O)c1ccc(cc1O)-c1cccc(O)c1
Show InChI InChI=1S/C22H20N2O4/c23-21(27)19(11-14-5-2-1-3-6-14)24-22(28)18-10-9-16(13-20(18)26)15-7-4-8-17(25)12-15/h1-10,12-13,19,25-26H,11H2,(H2,23,27)(H,24,28)
Reactome pathway
n/an/a 6.13E+4n/an/an/an/an/an/a
The University of Queensland
Curated by ChEMBL
Assay Description
Inhibition of human H-PGDS expressed in Escherichia coli BL21 DE2 by enzyme immuno assay at 50 uM
J Med Chem 53: 5536-48 (2010)
Article DOI: 10.1021/jm100194a
BindingDB Entry DOI: 10.7270/Q21J99Z4
Prostaglandin D Synthase
(Homo sapiens (Human))
BDBM50324481
(CHEMBL1215446 | N-(1-amino-1-oxo-3-phenylpropan-2-...)
Show SMILES NC(=O)C(Cc1ccccc1)NC(=O)c1ccc(cc1O)-c1cccc(O)c1
Show InChI InChI=1S/C22H20N2O4/c23-21(27)19(11-14-5-2-1-3-6-14)24-22(28)18-10-9-16(13-20(18)26)15-7-4-8-17(25)12-15/h1-10,12-13,19,25-26H,11H2,(H2,23,27)(H,24,28)
Reactome pathway
n/an/a 2.48E+4n/an/an/an/an/an/a
The University of Queensland
Curated by ChEMBL
Assay Description
Inhibition of human H-PGDS expressed in Escherichia coli BL21 DE2 by enzyme immuno assay
J Med Chem 53: 5536-48 (2010)
Article DOI: 10.1021/jm100194a
BindingDB Entry DOI: 10.7270/Q21J99Z4