BDBM50324486 CHEMBL1215296::N-(1-Amino-1-oxo-3-phenylpropan-2-yl)-5-(3-hydroxyphenyl)-thiophene-2-carboxamide
SMILES: NC(=O)C(Cc1ccccc1)NC(=O)NC(=O)c1ccc(s1)-c1cccc(O)c1
InChI Key: InChIKey=IZJNBPFRRHLZTE-UHFFFAOYSA-N
Data: 2 IC50
Activity Spreadsheet -- Enzyme Inhibition Constant Data from BindingDB
Found 2 hits for monomerid = 50324486
Trg + Lig
Ki
nM
ΔG°
kcal/mole
IC50
nM
Kd
nM
EC50/IC50
nM
koff
s-1
kon
M-1s-1
pHTemp
°C
Prostaglandin D Synthase
(Homo sapiens (Human))
BDBM50324486
(CHEMBL1215296 | N-(1-Amino-1-oxo-3-phenylpropan-2-...)
Show SMILES NC(=O)C(Cc1ccccc1)NC(=O)NC(=O)c1ccc(s1)-c1cccc(O)c1
Show InChI InChI=1S/C21H19N3O4S/c22-19(26)16(11-13-5-2-1-3-6-13)23-21(28)24-20(27)18-10-9-17(29-18)14-7-4-8-15(25)12-14/h1-10,12,16,25H,11H2,(H2,22,26)(H2,23,24,27,28)
Reactome pathway
n/an/a 8.95E+4n/an/an/an/an/an/a
The University of Queensland
Curated by ChEMBL
Assay Description
Inhibition of human H-PGDS expressed in Escherichia coli BL21 DE2 by enzyme immuno assay at 50 uM
J Med Chem 53: 5536-48 (2010)
Article DOI: 10.1021/jm100194a
BindingDB Entry DOI: 10.7270/Q21J99Z4
Prostaglandin D Synthase
(Homo sapiens (Human))
BDBM50324486
(CHEMBL1215296 | N-(1-Amino-1-oxo-3-phenylpropan-2-...)
Show SMILES NC(=O)C(Cc1ccccc1)NC(=O)NC(=O)c1ccc(s1)-c1cccc(O)c1
Show InChI InChI=1S/C21H19N3O4S/c22-19(26)16(11-13-5-2-1-3-6-13)23-21(28)24-20(27)18-10-9-17(29-18)14-7-4-8-15(25)12-14/h1-10,12,16,25H,11H2,(H2,22,26)(H2,23,24,27,28)
Reactome pathway
n/an/a 3.70E+3n/an/an/an/an/an/a
The University of Queensland
Curated by ChEMBL
Assay Description
Inhibition of human H-PGDS expressed in Escherichia coli BL21 DE2 by enzyme immuno assay
J Med Chem 53: 5536-48 (2010)
Article DOI: 10.1021/jm100194a
BindingDB Entry DOI: 10.7270/Q21J99Z4