BDBM50324577 (S)-N-(2-(2-(Dimethylamino)ethoxy)-4-(1H-pyrazol-4-yl)-phenyl)-6-methoxy-1,2,3,4-tetrahydro-isoquinoline-3-carboxamide::CHEMBL1215237
SMILES: COc1ccc2CN[C@@H](Cc2c1)C(=O)Nc1ccc(cc1OCCN(C)C)-c1cn[nH]c1
InChI Key: InChIKey=JPIZMTCZKMZLDC-QFIPXVFZSA-N
Data: 2 IC50
Activity Spreadsheet -- Enzyme Inhibition Constant Data from BindingDB
Found 2 hits for monomerid = 50324577
Trg + Lig
Ki
nM
ΔG°
kcal/mole
IC50
nM
Kd
nM
EC50/IC50
nM
koff
s-1
kon
M-1s-1
pHTemp
°C
Rho-associated protein kinase 2
(Homo sapiens (Human))
BDBM50324577
((S)-N-(2-(2-(Dimethylamino)ethoxy)-4-(1H-pyrazol-4...)
Show SMILES COc1ccc2CN[C@@H](Cc2c1)C(=O)Nc1ccc(cc1OCCN(C)C)-c1cn[nH]c1 |r|
Show InChI InChI=1S/C24H29N5O3/c1-29(2)8-9-32-23-12-16(19-14-26-27-15-19)5-7-21(23)28-24(30)22-11-18-10-20(31-3)6-4-17(18)13-25-22/h4-7,10,12,14-15,22,25H,8-9,11,13H2,1-3H3,(H,26,27)(H,28,30)/t22-/m0/s1
n/an/a 41n/an/an/an/an/an/a
The Scripps Research Institute
Curated by ChEMBL
Assay Description
Inhibition of ROCK2 assessed as myosin light chain phosphorylation by cell-based assay
J Med Chem 53: 5727-37 (2010)
Article DOI: 10.1021/jm100579r
BindingDB Entry DOI: 10.7270/Q2833S8C
Rho-associated protein kinase 2
(Homo sapiens (Human))
BDBM50324577
((S)-N-(2-(2-(Dimethylamino)ethoxy)-4-(1H-pyrazol-4...)
Show SMILES COc1ccc2CN[C@@H](Cc2c1)C(=O)Nc1ccc(cc1OCCN(C)C)-c1cn[nH]c1 |r|
Show InChI InChI=1S/C24H29N5O3/c1-29(2)8-9-32-23-12-16(19-14-26-27-15-19)5-7-21(23)28-24(30)22-11-18-10-20(31-3)6-4-17(18)13-25-22/h4-7,10,12,14-15,22,25H,8-9,11,13H2,1-3H3,(H,26,27)(H,28,30)/t22-/m0/s1
n/an/a 10n/an/an/an/an/an/a
The Scripps Research Institute
Curated by ChEMBL
Assay Description
Inhibition of ROCK2
J Med Chem 53: 5727-37 (2010)
Article DOI: 10.1021/jm100579r
BindingDB Entry DOI: 10.7270/Q2833S8C