BDBM50324584 (R)-6-Methoxy-N-(2-(2-methoxyethoxy)-4-(1H-pyrazol-4-yl)-phenyl)-1,2,3,4-tetrahydroisoquino-line-3-carboxamide::CHEMBL1215377
SMILES: COCCOc1cc(ccc1NC(=O)[C@H]1Cc2cc(OC)ccc2CN1)-c1cn[nH]c1
InChI Key: InChIKey=QUSZKYCDXDOFEK-OAQYLSRUSA-N
Data: 2 IC50
Activity Spreadsheet -- Enzyme Inhibition Constant Data from BindingDB
Found 2 hits for monomerid = 50324584
Trg + Lig
Ki
nM
ΔG°
kcal/mole
IC50
nM
Kd
nM
EC50/IC50
nM
koff
s-1
kon
M-1s-1
pHTemp
°C
Rho-associated protein kinase 2
(Homo sapiens (Human))
BDBM50324584
((R)-6-Methoxy-N-(2-(2-methoxyethoxy)-4-(1H-pyrazol...)
Show SMILES COCCOc1cc(ccc1NC(=O)[C@H]1Cc2cc(OC)ccc2CN1)-c1cn[nH]c1 |r|
Show InChI InChI=1S/C23H26N4O4/c1-29-7-8-31-22-11-15(18-13-25-26-14-18)4-6-20(22)27-23(28)21-10-17-9-19(30-2)5-3-16(17)12-24-21/h3-6,9,11,13-14,21,24H,7-8,10,12H2,1-2H3,(H,25,26)(H,27,28)/t21-/m1/s1
n/an/a 339n/an/an/an/an/an/a
The Scripps Research Institute
Curated by ChEMBL
Assay Description
Inhibition of ROCK2 assessed as myosin light chain phosphorylation by cell-based assay
J Med Chem 53: 5727-37 (2010)
Article DOI: 10.1021/jm100579r
BindingDB Entry DOI: 10.7270/Q2833S8C
Rho-associated protein kinase 2
(Homo sapiens (Human))
BDBM50324584
((R)-6-Methoxy-N-(2-(2-methoxyethoxy)-4-(1H-pyrazol...)
Show SMILES COCCOc1cc(ccc1NC(=O)[C@H]1Cc2cc(OC)ccc2CN1)-c1cn[nH]c1 |r|
Show InChI InChI=1S/C23H26N4O4/c1-29-7-8-31-22-11-15(18-13-25-26-14-18)4-6-20(22)27-23(28)21-10-17-9-19(30-2)5-3-16(17)12-24-21/h3-6,9,11,13-14,21,24H,7-8,10,12H2,1-2H3,(H,25,26)(H,27,28)/t21-/m1/s1
n/an/a 25n/an/an/an/an/an/a
The Scripps Research Institute
Curated by ChEMBL
Assay Description
Inhibition of ROCK2
J Med Chem 53: 5727-37 (2010)
Article DOI: 10.1021/jm100579r
BindingDB Entry DOI: 10.7270/Q2833S8C