BDBM50324697 CHEMBL1221989::Lactivicin
SMILES: CC(=O)N[C@H]1CON(C1=O)[C@]1(CCC(=O)O1)C(O)=O
InChI Key: InChIKey=ZUEKKUYIXILDAF-WKEGUHRASA-N
Data: 1 IC50
Activity Spreadsheet -- Enzyme Inhibition Constant Data from BindingDB
Found 1 hit for monomerid = 50324697
Trg + Lig
Ki
nM
ΔG°
kcal/mole
IC50
nM
Kd
nM
EC50/IC50
nM
koff
s-1
kon
M-1s-1
pHTemp
°C
Penicillin-binding protein 2x
(Streptococcus pneumoniae)
BDBM50324697
(CHEMBL1221989 | Lactivicin)
Show SMILES CC(=O)N[C@H]1CON(C1=O)[C@]1(CCC(=O)O1)C(O)=O |r|
Show InChI InChI=1S/C10H12N2O7/c1-5(13)11-6-4-18-12(8(6)15)10(9(16)17)3-2-7(14)19-10/h6H,2-4H2,1H3,(H,11,13)(H,16,17)/t6-,10-/m0/s1
n/an/a 1.50E+5n/an/an/an/an/an/a
Universit£ Joseph Fourier
Curated by ChEMBL
Assay Description
Inhibition of penicillin-resistant Streptococcus pneumoniae 5204 PBP2x after 120 mins by SDS-PAGE
Nat Chem Biol 3: 565-9 (2007)
Article DOI: 10.1038/nchembio.2007.21
BindingDB Entry DOI: 10.7270/Q2JM2BK9