BDBM50324806 (S,E)-2-(5,7-dichloro-2-(3-(furan-2-yl)acryloyl)-1,2,3,4-tetrahydroisoquinoline-6-carboxamido)-3-(thiophene-2-carboxamido)propanoic acid::CHEMBL1221919
SMILES: OC(=O)[C@H](CNC(=O)c1cccs1)NC(=O)c1c(Cl)cc2CN(CCc2c1Cl)C(=O)\C=C\c1ccco1
InChI Key: InChIKey=WHGBQVUQKROPLI-QWNKOJSDSA-N
Data: 1 IC50
Activity Spreadsheet -- Enzyme Inhibition Constant Data from BindingDB
Found 1 hit for monomerid = 50324806
Trg + Lig
Ki
nM
ΔG°
kcal/mole
IC50
nM
Kd
nM
EC50/IC50
nM
koff
s-1
kon
M-1s-1
pHTemp
°C
Integrin beta-2/Intercellular adhesion molecule 1
(Homo sapiens (Human))
BDBM50324806
((S,E)-2-(5,7-dichloro-2-(3-(furan-2-yl)acryloyl)-1...)
Show SMILES OC(=O)[C@H](CNC(=O)c1cccs1)NC(=O)c1c(Cl)cc2CN(CCc2c1Cl)C(=O)\C=C\c1ccco1 |r|
Show InChI InChI=1S/C25H21Cl2N3O6S/c26-17-11-14-13-30(20(31)6-5-15-3-1-9-36-15)8-7-16(14)22(27)21(17)24(33)29-18(25(34)35)12-28-23(32)19-4-2-10-37-19/h1-6,9-11,18H,7-8,12-13H2,(H,28,32)(H,29,33)(H,34,35)/b6-5+/t18-/m0/s1
n/an/a 25n/an/an/an/an/an/a
Sunesis Pharmaceuticals, Inc.
Curated by ChEMBL
Assay Description
Inhibition of LFA1/ICAM1 interaction in human Hut-78 cells by cell migration assay
Bioorg Med Chem Lett 20: 5269-73 (2010)
Article DOI: 10.1016/j.bmcl.2010.06.145
BindingDB Entry DOI: 10.7270/Q2N58MKB