BDBM50324946 (R)-2-((S)-2-isopropyl-4-oxo-4-(2-(quinolin-4-yl)ethylamino)butanamido)-3-oxopropanoic acid::CHEMBL1221743
SMILES: CC(C)[C@H](CC(=O)NCCc1ccnc2ccccc12)C(=O)N[C@@H](CC(O)=O)C=O
InChI Key: InChIKey=FEADORLLBOLZFS-WMZOPIPTSA-N
Data: 1 KI  1 IC50
Activity Spreadsheet -- Enzyme Inhibition Constant Data from BindingDB
Found 2 hits for monomerid = 50324946
Trg + Lig
Ki
nM
ΔG°
kcal/mole
IC50
nM
Kd
nM
EC50/IC50
nM
koff
s-1
kon
M-1s-1
pHTemp
°C
Caspase-1
(Homo sapiens (Human))
BDBM50324946
((R)-2-((S)-2-isopropyl-4-oxo-4-(2-(quinolin-4-yl)e...)
Show SMILES CC(C)[C@H](CC(=O)NCCc1ccnc2ccccc12)C(=O)N[C@@H](CC(O)=O)C=O |r|
Show InChI InChI=1S/C22H27N3O5/c1-14(2)18(22(30)25-16(13-26)11-21(28)29)12-20(27)24-10-8-15-7-9-23-19-6-4-3-5-17(15)19/h3-7,9,13-14,16,18H,8,10-12H2,1-2H3,(H,24,27)(H,25,30)(H,28,29)/t16-,18-/m0/s1
NCI pathway
Reactome pathway
1.31n/an/an/an/an/an/an/an/a
Pfizer Inc.
Curated by ChEMBL
Assay Description
Inhibition of human ICE
Bioorg Med Chem Lett 20: 5184-90 (2010)
Article DOI: 10.1016/j.bmcl.2010.07.004
BindingDB Entry DOI: 10.7270/Q2QZ2B5X
Caspase-1
(Homo sapiens (Human))
BDBM50324946
((R)-2-((S)-2-isopropyl-4-oxo-4-(2-(quinolin-4-yl)e...)
Show SMILES CC(C)[C@H](CC(=O)NCCc1ccnc2ccccc12)C(=O)N[C@@H](CC(O)=O)C=O |r|
Show InChI InChI=1S/C22H27N3O5/c1-14(2)18(22(30)25-16(13-26)11-21(28)29)12-20(27)24-10-8-15-7-9-23-19-6-4-3-5-17(15)19/h3-7,9,13-14,16,18H,8,10-12H2,1-2H3,(H,24,27)(H,25,30)(H,28,29)/t16-,18-/m0/s1
NCI pathway
Reactome pathway
n/an/a 4.77n/an/an/an/an/an/a
Pfizer Inc.
Curated by ChEMBL
Assay Description
Inhibition of human ICE
Bioorg Med Chem Lett 20: 5184-90 (2010)
Article DOI: 10.1016/j.bmcl.2010.07.004
BindingDB Entry DOI: 10.7270/Q2QZ2B5X