BDBM50325046 1-((1-benzyl-1H-tetrazol-5-yl)(4-fluorophenyl)methyl)-4-cyclohexylpiperazine::CHEMBL1222870
SMILES: Fc1ccc(cc1)C(N1CCN(CC1)C1CCCCC1)c1nnnn1Cc1ccccc1
InChI Key: InChIKey=QMNIXPDBWAYAOR-UHFFFAOYSA-N
Data: 1 IC50
Activity Spreadsheet -- Enzyme Inhibition Constant Data from BindingDB
Found 1 hit for monomerid = 50325046
Trg + Lig
Ki
nM
ΔG°
kcal/mole
IC50
nM
Kd
nM
EC50/IC50
nM
koff
s-1
kon
M-1s-1
pHTemp
°C
Histamine H3 receptor
(Homo sapiens (Human))
BDBM50325046
(1-((1-benzyl-1H-tetrazol-5-yl)(4-fluorophenyl)meth...)
Show SMILES Fc1ccc(cc1)C(N1CCN(CC1)C1CCCCC1)c1nnnn1Cc1ccccc1
Show InChI InChI=1S/C25H31FN6/c26-22-13-11-21(12-14-22)24(25-27-28-29-32(25)19-20-7-3-1-4-8-20)31-17-15-30(16-18-31)23-9-5-2-6-10-23/h1,3-4,7-8,11-14,23-24H,2,5-6,9-10,15-19H2
Reactome pathway
n/an/a 285n/an/an/an/an/an/a
Evotec (UK) Ltd
Curated by ChEMBL
Assay Description
Antagonist activity at human histamine H3 receptor
Bioorg Med Chem Lett 20: 5165-9 (2010)
Article DOI: 10.1016/j.bmcl.2010.07.009
BindingDB Entry DOI: 10.7270/Q2TQ61RV