BDBM50325061 1-((1-benzyl-1H-tetrazol-5-yl)(4-fluorophenyl)methyl)-N,N-dimethylpiperidin-3-amine::CHEMBL1223082
SMILES: CN(C)C1CCCN(C1)C(c1nnnn1Cc1ccccc1)c1ccc(F)cc1
InChI Key: InChIKey=IXIZVBISXXXRIK-UHFFFAOYSA-N
Data: 1 IC50
Activity Spreadsheet -- Enzyme Inhibition Constant Data from BindingDB
Found 1 hit for monomerid = 50325061
Trg + Lig
Ki
nM
ΔG°
kcal/mole
IC50
nM
Kd
nM
EC50/IC50
nM
koff
s-1
kon
M-1s-1
pHTemp
°C
Histamine H3 receptor
(Homo sapiens (Human))
BDBM50325061
(1-((1-benzyl-1H-tetrazol-5-yl)(4-fluorophenyl)meth...)
Show SMILES CN(C)C1CCCN(C1)C(c1nnnn1Cc1ccccc1)c1ccc(F)cc1
Show InChI InChI=1S/C22H27FN6/c1-27(2)20-9-6-14-28(16-20)21(18-10-12-19(23)13-11-18)22-24-25-26-29(22)15-17-7-4-3-5-8-17/h3-5,7-8,10-13,20-21H,6,9,14-16H2,1-2H3
Reactome pathway
n/an/a 2.47E+3n/an/an/an/an/an/a
Evotec (UK) Ltd
Curated by ChEMBL
Assay Description
Antagonist activity at human histamine H3 receptor
Bioorg Med Chem Lett 20: 5165-9 (2010)
Article DOI: 10.1016/j.bmcl.2010.07.009
BindingDB Entry DOI: 10.7270/Q2TQ61RV